{"text_format":"3","workbook":"xlsx","n_sheets":10,"sheets":["Student Entry","Fig 1 Ballet Leg","Fig 2 Kip","Fig 3 Heron","Fig 4 Walkover","Totals","Draw","Schools","Official Draw","Meet Results"],"not_rendered":{"images":1,"macros":1,"defined_names":5,"pivot_tables":3},"read":"whole","date_system":"1900"}

{"sheet":"Student Entry","index":0,"n_rows":26,"n_cols":3,"rows_kept":26,"merged":[[0,0,0,2]]}
["Student Entry"]
["School # 1 Name:","School # 2 Name:","School # 3 Name:"]
["Stillwater","Osseo-Maple Grove","Edina"]
["Student Names:","Student Names:","Student Names:"]
["Erin Wurgler","Mikaela Crosby"]
["Maddie Stricker","Annika Desphande"]
["Elly Blair","Savanna Woods"]
["Samantha MacDonald","Paulina Frayman"]
["Kya Hodgdon","Kati Knox"]
["Leigha Kraft"]
{"$rows_left_out":17}
{"sheet":"Fig 1 Ballet Leg","index":1,"n_rows":150,"n_cols":11,"rows_kept":150}
[null,"Figure #1:","101 R/L Ballet Leg, single, *right or *left"]
["#","Degree of Difficulty","Judge 1","Judge 2","Judge 3","Judge 4","Judge 5","Score","Penalty"]
[{"$f":"IF(Draw!E2=0,\"\",Draw!E2)","v":1},1.6,{"$nulls":5},{"$f":"IF(B3=\"\",\"\",IF(K3=5,(SUM(C3:G3)-MAX(C3:G3)-MIN(C3:G3))/3,IF(K3=4,(SUM(C3:G3)-MAX(C3:G3))/3,SUM(C3:G3)/3))*B3/7.6)","v":{"v":0,"d":"0.000"}},null,null,{"$f":"COUNT(C3:G3)","v":0}]
[{"$f":"IF(Draw!E3=0,\"\",Draw!E3)","v":2},{"$f":"IF(A4=\"\",\"\",B$3)","v":1.6},60,63,63,null,null,{"$f":"IF(B4=\"\",\"\",IF(K4=5,(SUM(C4:G4)-MAX(C4:G4)-MIN(C4:G4))/3,IF(K4=4,(SUM(C4:G4)-MAX(C4:G4))/3,SUM(C4:G4)/3))*B4/7.6)","v":{"v":13.05263157894737,"d":"13.053"}},null,null,{"$f":"COUNT(C4:G4)","v":3}]
[{"$f":"IF(Draw!E4=0,\"\",Draw!E4)","v":3},{"$f":"IF(A5=\"\",\"\",B$3)","v":1.6},48,45,44,null,null,{"v":9.614035087719298,"d":"9.614"},null,null,3]
[{"$f":"IF(Draw!E5=0,\"\",Draw!E5)","v":4},1.6,49,49,50,null,null,{"$f":"IF(B6=\"\",\"\",IF(K6=5,(SUM(C6:G6)-MAX(C6:G6)-MIN(C6:G6))/3,IF(K6=4,(SUM(C6:G6)-MAX(C6:G6))/3,SUM(C6:G6)/3))*B6/7.6)","v":{"v":10.385964912280702,"d":"10.386"}},null,null,3]
[{"$f":"IF(Draw!E6=0,\"\",Draw!E6)","v":5},{"$f":"IF(A7=\"\",\"\",B$3)","v":1.6},54,54,51,null,null,{"v":11.157894736842108,"d":"11.158"},null,null,3]
[{"$f":"IF(Draw!E7=0,\"\",Draw!E7)","v":6},1.6,53,55,50,null,null,{"v":11.087719298245615,"d":"11.088"},null,null,3]
[{"$f":"IF(Draw!E8=0,\"\",Draw!E8)","v":7},1.6,64,60,64,null,null,{"v":13.192982456140351,"d":"13.193"},null,null,3]
[{"$f":"IF(Draw!E9=0,\"\",Draw!E9)","v":8},1.6,41,42,43,null,null,{"v":8.842105263157896,"d":"8.842"},null,null,3]
{"$rows_left_out":141}
{"sheet":"Fig 2 Kip","index":2,"n_rows":150,"n_cols":11,"rows_kept":150,"merged":[[0,2,0,6]]}
[null,"Figure #2:","311 Kip"]
["#","Degree of Difficulty","Judge 1","Judge 2","Judge 3","Judge 4","Judge 5","Score","Penalty"]
[{"$f":"IF(Draw!E2=0,\"\",Draw!E2)","v":1},1.8,{"$nulls":5},{"$f":"IF(B3=\"\",\"\",IF(K3=5,(SUM(C3:G3)-MAX(C3:G3)-MIN(C3:G3))/3,IF(K3=4,(SUM(C3:G3)-MAX(C3:G3))/3,SUM(C3:G3)/3))*B3/7.6)","v":{"v":0,"d":"0.000"}},null,null,{"$f":"COUNT(C3:G3)","v":0}]
[{"$f":"IF(Draw!E3=0,\"\",Draw!E3)","v":2},{"$f":"IF(A4=\"\",\"\",B$3)","v":1.8},57,60,56,null,null,{"$f":"IF(B4=\"\",\"\",IF(K4=5,(SUM(C4:G4)-MAX(C4:G4)-MIN(C4:G4))/3,IF(K4=4,(SUM(C4:G4)-MAX(C4:G4))/3,SUM(C4:G4)/3))*B4/7.6)","v":{"v":13.657894736842106,"d":"13.658"}},null,null,{"$f":"COUNT(C4:G4)","v":3}]
[{"$f":"IF(Draw!E4=0,\"\",Draw!E4)","v":3},{"$f":"IF(A5=\"\",\"\",B$3)","v":1.8},48,50,46,null,null,{"$f":"IF(B5=\"\",\"\",IF(K5=5,(SUM(C5:G5)-MAX(C5:G5)-MIN(C5:G5))/3,IF(K5=4,(SUM(C5:G5)-MAX(C5:G5))/3,SUM(C5:G5)/3))*B5/7.6)","v":{"v":11.36842105263158,"d":"11.368"}},null,null,3]
[{"$f":"IF(Draw!E5=0,\"\",Draw!E5)","v":4},1.8,57,53,50,null,null,{"$f":"IF(B6=\"\",\"\",IF(K6=5,(SUM(C6:G6)-MAX(C6:G6)-MIN(C6:G6))/3,IF(K6=4,(SUM(C6:G6)-MAX(C6:G6))/3,SUM(C6:G6)/3))*B6/7.6)","v":{"v":12.631578947368421,"d":"12.632"}},null,null,3]
[{"$f":"IF(Draw!E6=0,\"\",Draw!E6)","v":5},{"$f":"IF(A7=\"\",\"\",B$3)","v":1.8},57,55,51,null,null,{"$f":"IF(B7=\"\",\"\",IF(K7=5,(SUM(C7:G7)-MAX(C7:G7)-MIN(C7:G7))/3,IF(K7=4,(SUM(C7:G7)-MAX(C7:G7))/3,SUM(C7:G7)/3))*B7/7.6)","v":{"v":12.86842105263158,"d":"12.868"}},null,null,3]
[{"$f":"IF(Draw!E7=0,\"\",Draw!E7)","v":6},1.8,54,52,53,null,null,{"$f":"IF(B8=\"\",\"\",IF(K8=5,(SUM(C8:G8)-MAX(C8:G8)-MIN(C8:G8))/3,IF(K8=4,(SUM(C8:G8)-MAX(C8:G8))/3,SUM(C8:G8)/3))*B8/7.6)","v":{"v":12.55263157894737,"d":"12.553"}},null,null,3]
[{"$f":"IF(Draw!E8=0,\"\",Draw!E8)","v":7},1.8,62,64,65,null,null,{"$f":"IF(B9=\"\",\"\",IF(K9=5,(SUM(C9:G9)-MAX(C9:G9)-MIN(C9:G9))/3,IF(K9=4,(SUM(C9:G9)-MAX(C9:G9))/3,SUM(C9:G9)/3))*B9/7.6)","v":{"v":15.078947368421053,"d":"15.079"}},null,null,3]
[{"$f":"IF(Draw!E9=0,\"\",Draw!E9)","v":8},1.8,46,50,44,null,null,{"$f":"IF(B10=\"\",\"\",IF(K10=5,(SUM(C10:G10)-MAX(C10:G10)-MIN(C10:G10))/3,IF(K10=4,(SUM(C10:G10)-MAX(C10:G10))/3,SUM(C10:G10)/3))*B10/7.6)","v":{"v":11.052631578947368,"d":"11.053"}},null,null,3]
{"$rows_left_out":141}
{"sheet":"Fig 3 Heron","index":3,"n_rows":150,"n_cols":11,"rows_kept":150,"merged":[[0,2,0,6]]}
[null,"Figure #3:","342 Heron"]
["#","Degree of Difficulty","Judge 1","Judge 2","Judge 3","Judge 4","Judge 5","Score","Penalty"]
[{"$f":"IF(Draw!E2=0,\"\",Draw!E2)","v":1},2.1,{"$nulls":5},{"$f":"IF(B3=\"\",\"\",IF(K3=5,(SUM(C3:G3)-MAX(C3:G3)-MIN(C3:G3))/3,IF(K3=4,(SUM(C3:G3)-MAX(C3:G3))/3,SUM(C3:G3)/3))*B3/7.6)","v":{"v":0,"d":"0.000"}},null,null,{"$f":"COUNT(C3:G3)","v":0}]
[{"$f":"IF(Draw!E3=0,\"\",Draw!E3)","v":2},{"$f":"IF(A4=\"\",\"\",B$3)","v":2.1},60,62,66,null,null,{"$f":"IF(B4=\"\",\"\",IF(K4=5,(SUM(C4:G4)-MAX(C4:G4)-MIN(C4:G4))/3,IF(K4=4,(SUM(C4:G4)-MAX(C4:G4))/3,SUM(C4:G4)/3))*B4/7.6)","v":{"v":17.31578947368421,"d":"17.316"}},null,null,{"$f":"COUNT(C4:G4)","v":3}]
[{"$f":"IF(Draw!E4=0,\"\",Draw!E4)","v":3},{"$f":"IF(A5=\"\",\"\",B$3)","v":2.1},46,49,51,null,null,{"$f":"IF(B5=\"\",\"\",IF(K5=5,(SUM(C5:G5)-MAX(C5:G5)-MIN(C5:G5))/3,IF(K5=4,(SUM(C5:G5)-MAX(C5:G5))/3,SUM(C5:G5)/3))*B5/7.6)","v":{"v":13.447368421052632,"d":"13.447"}},null,null,3]
[{"$f":"IF(Draw!E5=0,\"\",Draw!E5)","v":4},2.1,48,52,46,null,null,{"$f":"IF(B6=\"\",\"\",IF(K6=5,(SUM(C6:G6)-MAX(C6:G6)-MIN(C6:G6))/3,IF(K6=4,(SUM(C6:G6)-MAX(C6:G6))/3,SUM(C6:G6)/3))*B6/7.6)","v":{"v":13.447368421052632,"d":"13.447"}},null,null,3]
[{"$f":"IF(Draw!E6=0,\"\",Draw!E6)","v":5},{"$f":"IF(A7=\"\",\"\",B$3)","v":2.1},52,56,54,null,null,{"$f":"IF(B7=\"\",\"\",IF(K7=5,(SUM(C7:G7)-MAX(C7:G7)-MIN(C7:G7))/3,IF(K7=4,(SUM(C7:G7)-MAX(C7:G7))/3,SUM(C7:G7)/3))*B7/7.6)","v":{"v":14.921052631578949,"d":"14.921"}},null,null,3]
[{"$f":"IF(Draw!E7=0,\"\",Draw!E7)","v":6},2.1,45,48,44,null,null,{"$f":"IF(B8=\"\",\"\",IF(K8=5,(SUM(C8:G8)-MAX(C8:G8)-MIN(C8:G8))/3,IF(K8=4,(SUM(C8:G8)-MAX(C8:G8))/3,SUM(C8:G8)/3))*B8/7.6)","v":{"v":12.61842105263158,"d":"12.618"}},null,null,3]
[{"$f":"IF(Draw!E8=0,\"\",Draw!E8)","v":7},2.1,63,60,56,null,null,{"$f":"IF(B9=\"\",\"\",IF(K9=5,(SUM(C9:G9)-MAX(C9:G9)-MIN(C9:G9))/3,IF(K9=4,(SUM(C9:G9)-MAX(C9:G9))/3,SUM(C9:G9)/3))*B9/7.6)","v":{"v":16.486842105263158,"d":"16.487"}},null,null,3]
[{"$f":"IF(Draw!E9=0,\"\",Draw!E9)","v":8},2.1,44,48,44,null,null,{"$f":"IF(B10=\"\",\"\",IF(K10=5,(SUM(C10:G10)-MAX(C10:G10)-MIN(C10:G10))/3,IF(K10=4,(SUM(C10:G10)-MAX(C10:G10))/3,SUM(C10:G10)/3))*B10/7.6)","v":{"v":12.526315789473685,"d":"12.526"}},null,null,3]
{"$rows_left_out":141}
{"sheet":"Fig 4 Walkover","index":4,"n_rows":150,"n_cols":11,"rows_kept":150,"merged":[[0,2,0,6]]}
[null,"Figure #4:","360 Walkover Front"]
["#","Degree of Difficulty","Judge 1","Judge 2","Judge 3","Judge 4","Judge 5","Score","Penalty"]
[{"$f":"IF(Draw!E2=0,\"\",Draw!E2)","v":1},2.1,{"$nulls":5},{"$f":"IF(B3=\"\",\"\",IF(K3=5,(SUM(C3:G3)-MAX(C3:G3)-MIN(C3:G3))/3,IF(K3=4,(SUM(C3:G3)-MAX(C3:G3))/3,SUM(C3:G3)/3))*B3/7.6)","v":{"v":0,"d":"0.000"}},null,null,{"$f":"COUNT(C3:G3)","v":0}]
[{"$f":"IF(Draw!E3=0,\"\",Draw!E3)","v":2},{"$f":"IF(A4=\"\",\"\",B$3)","v":2.1},59,60,63,null,null,{"$f":"IF(B4=\"\",\"\",IF(K4=5,(SUM(C4:G4)-MAX(C4:G4)-MIN(C4:G4))/3,IF(K4=4,(SUM(C4:G4)-MAX(C4:G4))/3,SUM(C4:G4)/3))*B4/7.6)","v":{"v":16.763157894736842,"d":"16.763"}},null,null,{"$f":"COUNT(C4:G4)","v":3}]
[{"$f":"IF(Draw!E4=0,\"\",Draw!E4)","v":3},{"$f":"IF(A5=\"\",\"\",B$3)","v":2.1},43,50,51,null,null,{"$f":"IF(B5=\"\",\"\",IF(K5=5,(SUM(C5:G5)-MAX(C5:G5)-MIN(C5:G5))/3,IF(K5=4,(SUM(C5:G5)-MAX(C5:G5))/3,SUM(C5:G5)/3))*B5/7.6)","v":{"v":13.263157894736844,"d":"13.263"}},null,null,3]
[{"$f":"IF(Draw!E5=0,\"\",Draw!E5)","v":4},2.1,52,49,47,null,null,{"$f":"IF(B6=\"\",\"\",IF(K6=5,(SUM(C6:G6)-MAX(C6:G6)-MIN(C6:G6))/3,IF(K6=4,(SUM(C6:G6)-MAX(C6:G6))/3,SUM(C6:G6)/3))*B6/7.6)","v":{"v":13.631578947368423,"d":"13.632"}},null,null,3]
[{"$f":"IF(Draw!E6=0,\"\",Draw!E6)","v":5},{"$f":"IF(A7=\"\",\"\",B$3)","v":2.1},56,56,53,null,null,{"$f":"IF(B7=\"\",\"\",IF(K7=5,(SUM(C7:G7)-MAX(C7:G7)-MIN(C7:G7))/3,IF(K7=4,(SUM(C7:G7)-MAX(C7:G7))/3,SUM(C7:G7)/3))*B7/7.6)","v":{"v":15.197368421052632,"d":"15.197"}},null,null,3]
[{"$f":"IF(Draw!E7=0,\"\",Draw!E7)","v":6},2.1,50,53,50,null,null,{"$f":"IF(B8=\"\",\"\",IF(K8=5,(SUM(C8:G8)-MAX(C8:G8)-MIN(C8:G8))/3,IF(K8=4,(SUM(C8:G8)-MAX(C8:G8))/3,SUM(C8:G8)/3))*B8/7.6)","v":{"v":14.092105263157897,"d":"14.092"}},null,null,3]
[{"$f":"IF(Draw!E8=0,\"\",Draw!E8)","v":7},2.1,63,61,66,null,null,{"$f":"IF(B9=\"\",\"\",IF(K9=5,(SUM(C9:G9)-MAX(C9:G9)-MIN(C9:G9))/3,IF(K9=4,(SUM(C9:G9)-MAX(C9:G9))/3,SUM(C9:G9)/3))*B9/7.6)","v":{"v":17.5,"d":"17.500"}},null,null,3]
[{"$f":"IF(Draw!E9=0,\"\",Draw!E9)","v":8},2.1,53,48,48,null,null,{"$f":"IF(B10=\"\",\"\",IF(K10=5,(SUM(C10:G10)-MAX(C10:G10)-MIN(C10:G10))/3,IF(K10=4,(SUM(C10:G10)-MAX(C10:G10))/3,SUM(C10:G10)/3))*B10/7.6)","v":{"v":13.723684210526317,"d":"13.724"}},null,null,3]
{"$rows_left_out":141}
{"sheet":"Totals","index":5,"n_rows":151,"n_cols":51,"rows_kept":151}
["#","Swimmer","School","Total Score","Place","Figure 1","Figure 2","Figure 3","Figure 4","Penalties","Score"]
[{"$f":"IF(Draw!E8=0,\"\",Draw!E8)","v":7},"Anika Wright","Stillwater",{"$f":"IF($A2=\"\",\"\",SUM(F2:I2)-J2)","v":{"v":62.25877192982456,"d":"62.259"}},{"$f":"IF($A2=\"\",\"\",RANK(D2,D$2:D$150))","v":1},{"$f":"IF($A2=\"\",\"\",'Fig 1 Ballet Leg'!H9)","v":{"v":13.192982456140351,"d":"13.193"}},{"$f":"IF($A2=\"\",\"\",'Fig 2 Kip'!H9)","v":{"v":15.078947368421053,"d":"15.079"}},{"$f":"IF($A2=\"\",\"\",'Fig 3 Heron'!H9)","v":{"v":16.486842105263158,"d":"16.487"}},{"$f":"IF($A2=\"\",\"\",'Fig 4 Walkover'!H9)","v":{"v":17.5,"d":"17.500"}},{"$f":"IF($A2=\"\",\"\",'Fig 1 Ballet Leg'!I9+'Fig 2 Kip'!I9+'Fig 3 Heron'!I9+'Fig 4 Walkover'!I9)","v":{"v":0,"d":"0.0"}},{"$f":"IF($A2=\"\",\"\",IF(A2=\"\",\"\",VLOOKUP(E2,AX$3:AY$102,2,FALSE)))","v":8}]
[{"$f":"IF(Draw!E3=0,\"\",Draw!E3)","v":2},"Erin Wurgler","Stillwater",{"v":60.78947368421053,"d":"60.789"},2,{"$f":"IF($A3=\"\",\"\",'Fig 1 Ballet Leg'!H4)","v":{"v":13.05263157894737,"d":"13.053"}},{"$f":"IF($A3=\"\",\"\",'Fig 2 Kip'!H4)","v":{"v":13.657894736842106,"d":"13.658"}},{"$f":"IF($A3=\"\",\"\",'Fig 3 Heron'!H4)","v":{"v":17.31578947368421,"d":"17.316"}},{"$f":"IF($A3=\"\",\"\",'Fig 4 Walkover'!H4)","v":{"v":16.763157894736842,"d":"16.763"}},{"$f":"IF($A3=\"\",\"\",'Fig 1 Ballet Leg'!I4+'Fig 2 Kip'!I4+'Fig 3 Heron'!I4+'Fig 4 Walkover'!I4)","v":{"v":0,"d":"0.0"}},6,{"$nulls":38},1,8]
[{"$f":"IF(Draw!E15=0,\"\",Draw!E15)","v":14},"Chloe Knuteson","Stillwater",{"v":60.45175438596492,"d":"60.452"},3,{"$f":"IF($A4=\"\",\"\",'Fig 1 Ballet Leg'!H16)","v":{"v":13.122807017543863,"d":"13.123"}},{"$f":"IF($A4=\"\",\"\",'Fig 2 Kip'!H16)","v":{"v":13.342105263157896,"d":"13.342"}},{"$f":"IF($A4=\"\",\"\",'Fig 3 Heron'!H16)","v":{"v":16.855263157894736,"d":"16.855"}},{"$f":"IF($A4=\"\",\"\",'Fig 4 Walkover'!H16)","v":{"v":17.131578947368425,"d":"17.132"}},{"$f":"IF($A4=\"\",\"\",'Fig 1 Ballet Leg'!I16+'Fig 2 Kip'!I16+'Fig 3 Heron'!I16+'Fig 4 Walkover'!I16)","v":{"v":0,"d":"0.0"}},5,{"$nulls":38},2,6]
[{"$f":"IF(Draw!E12=0,\"\",Draw!E12)","v":11},"Adelee Wrightsman","Stillwater",{"v":60.17982456140351,"d":"60.180"},4,{"$f":"IF($A5=\"\",\"\",'Fig 1 Ballet Leg'!H13)","v":{"v":12.982456140350878,"d":"12.982"}},{"$f":"IF($A5=\"\",\"\",'Fig 2 Kip'!H13)","v":{"v":13.026315789473685,"d":"13.026"}},{"$f":"IF($A5=\"\",\"\",'Fig 3 Heron'!H13)","v":{"v":16.947368421052634,"d":"16.947"}},{"$f":"IF($A5=\"\",\"\",'Fig 4 Walkover'!H13)","v":{"v":17.22368421052632,"d":"17.224"}},{"$f":"IF($A5=\"\",\"\",'Fig 1 Ballet Leg'!I13+'Fig 2 Kip'!I13+'Fig 3 Heron'!I13+'Fig 4 Walkover'!I13)","v":{"v":0,"d":"0.0"}},4,{"$nulls":38},3,5]
[{"$f":"IF(Draw!E26=0,\"\",Draw!E26)","v":25},"Kya Hodgdon","Stillwater",{"v":60.171052631578945,"d":"60.171"},5,{"$f":"IF($A6=\"\",\"\",'Fig 1 Ballet Leg'!H27)","v":{"v":13.473684210526317,"d":"13.474"}},{"$f":"IF($A6=\"\",\"\",'Fig 2 Kip'!H27)","v":{"v":14.36842105263158,"d":"14.368"}},{"$f":"IF($A6=\"\",\"\",'Fig 3 Heron'!H27)","v":{"v":15.657894736842106,"d":"15.658"}},{"$f":"IF($A6=\"\",\"\",'Fig 4 Walkover'!H27)","v":{"v":16.67105263157895,"d":"16.671"}},{"$f":"IF($A6=\"\",\"\",'Fig 1 Ballet Leg'!I27+'Fig 2 Kip'!I27+'Fig 3 Heron'!I27+'Fig 4 Walkover'!I27)","v":{"v":0,"d":"0.0"}},3,{"$nulls":38},4,4]
[{"$f":"IF(Draw!E22=0,\"\",Draw!E22)","v":21},"Maddie Stricker","Stillwater",{"v":59.885964912280706,"d":"59.886"},6,{"$f":"IF($A7=\"\",\"\",'Fig 1 Ballet Leg'!H23)","v":{"v":13.333333333333336,"d":"13.333"}},{"$f":"IF($A7=\"\",\"\",'Fig 2 Kip'!H23)","v":{"v":14.684210526315791,"d":"14.684"}},{"$f":"IF($A7=\"\",\"\",'Fig 3 Heron'!H23)","v":{"v":15.93421052631579,"d":"15.934"}},{"$f":"IF($A7=\"\",\"\",'Fig 4 Walkover'!H23)","v":{"v":15.93421052631579,"d":"15.934"}},{"$f":"IF($A7=\"\",\"\",'Fig 1 Ballet Leg'!I23+'Fig 2 Kip'!I23+'Fig 3 Heron'!I23+'Fig 4 Walkover'!I23)","v":{"v":0,"d":"0.0"}},2,{"$nulls":38},5,3]
[{"$f":"IF(Draw!E17=0,\"\",Draw!E17)","v":16},"Samantha MacDonald","Stillwater",{"v":59.30701754385966,"d":"59.307"},7,{"$f":"IF($A8=\"\",\"\",'Fig 1 Ballet Leg'!H18)","v":{"v":12.701754385964914,"d":"12.702"}},{"$f":"IF($A8=\"\",\"\",'Fig 2 Kip'!H18)","v":{"v":14.36842105263158,"d":"14.368"}},{"$f":"IF($A8=\"\",\"\",'Fig 3 Heron'!H18)","v":{"v":16.855263157894736,"d":"16.855"}},{"$f":"IF($A8=\"\",\"\",'Fig 4 Walkover'!H18)","v":{"v":15.381578947368423,"d":"15.382"}},{"$f":"IF($A8=\"\",\"\",'Fig 1 Ballet Leg'!I18+'Fig 2 Kip'!I18+'Fig 3 Heron'!I18+'Fig 4 Walkover'!I18)","v":{"v":0,"d":"0.0"}},1,{"$nulls":38},6,2]
[{"$f":"IF(Draw!E18=0,\"\",Draw!E18)","v":17},"Maylin Kennedy","Stillwater",{"v":58.82017543859649,"d":"58.820"},8,{"$f":"IF($A9=\"\",\"\",'Fig 1 Ballet Leg'!H19)","v":{"v":12.49122807017544,"d":"12.491"}},{"$f":"IF($A9=\"\",\"\",'Fig 2 Kip'!H19)","v":{"v":14.36842105263158,"d":"14.368"}},{"$f":"IF($A9=\"\",\"\",'Fig 3 Heron'!H19)","v":{"v":15.93421052631579,"d":"15.934"}},{"$f":"IF($A9=\"\",\"\",'Fig 4 Walkover'!H19)","v":{"v":16.026315789473685,"d":"16.026"}},{"$f":"IF($A9=\"\",\"\",'Fig 1 Ballet Leg'!I19+'Fig 2 Kip'!I19+'Fig 3 Heron'!I19+'Fig 4 Walkover'!I19)","v":{"v":0,"d":"0.0"}},0,{"$nulls":38},7,1]
[{"$f":"IF(Draw!E13=0,\"\",Draw!E13)","v":12},"Kennedy Tope","Stillwater",{"v":57.45175438596492,"d":"57.452"},9,{"$f":"IF($A10=\"\",\"\",'Fig 1 Ballet Leg'!H14)","v":{"v":12.49122807017544,"d":"12.491"}},{"$f":"IF($A10=\"\",\"\",'Fig 2 Kip'!H14)","v":{"v":12.631578947368421,"d":"12.632"}},{"$f":"IF($A10=\"\",\"\",'Fig 3 Heron'!H14)","v":{"v":16.486842105263158,"d":"16.487"}},{"$f":"IF($A10=\"\",\"\",'Fig 4 Walkover'!H14)","v":{"v":15.842105263157896,"d":"15.842"}},{"$f":"IF($A10=\"\",\"\",'Fig 1 Ballet Leg'!I14+'Fig 2 Kip'!I14+'Fig 3 Heron'!I14+'Fig 4 Walkover'!I14)","v":{"v":0,"d":"0.0"}},0,{"$nulls":38},8,0]
{"$rows_left_out":142}
{"sheet":"Draw","index":6,"n_rows":151,"n_cols":16,"rows_kept":151,"hidden":true}
[1,"Bloomington",{"$f":"RAND()","v":0.29190311021859316},{"$nulls":3},"School","Name","Draw #","Name","School"]
["Leigha Kraft","Stillwater",{"$f":"RAND()","v":0.4097173204537208},{"$f":"IF(ISNA(RANK(C2,C$2:C$150,1)),\"\",RANK(C2,C$2:C$150,1))","v":18},{"$f":"IF(B2<>\"\",F2,\"\")","v":1},1,{"$f":"B2","v":"Stillwater"},{"$f":"A2","v":"Leigha Kraft"},{"$f":"E2","v":1},{"$f":"IF(ISNA(VLOOKUP(I2,D$2:H$150,5,FALSE)),\"\",VLOOKUP(I2,D$2:H$150,5,FALSE))","v":"Paulina Frayman"},{"$f":"IF(ISNA(VLOOKUP(I2,D$2:G$150,4,FALSE)),\"\",VLOOKUP(I2,D$2:G$150,4,FALSE))","v":"Osseo-Maple Grove"},null,null,1,"Leigha Kraft","Stillwater"]
["Erin Wurgler","Stillwater",0.5677770070642678,{"$f":"IF(ISNA(RANK(C3,C$2:C$150,1)),\"\",RANK(C3,C$2:C$150,1))","v":21},{"$f":"IF(B3<>\"\",F3,\"\")","v":2},2,{"$f":"B3","v":"Stillwater"},{"$f":"A3","v":"Erin Wurgler"},{"$f":"E3","v":2},{"$f":"IF(ISNA(VLOOKUP(I3,D$2:H$150,5,FALSE)),\"\",VLOOKUP(I3,D$2:H$150,5,FALSE))","v":"Kati Knox"},{"$f":"IF(ISNA(VLOOKUP(I3,D$2:G$150,4,FALSE)),\"\",VLOOKUP(I3,D$2:G$150,4,FALSE))","v":"Osseo-Maple Grove"},null,null,2,"Erin Wurgler","Stillwater"]
["Kati Knox","Osseo-Maple Grove",0.03454971988089017,2,3,3,"Osseo-Maple Grove","Kati Knox",3,"Kyra Will","Stillwater",null,null,3,"Kati Knox","Osseo-Maple Grove"]
["Molly Goheen","Stillwater",0.15185277518908435,8,4,4,"Stillwater","Molly Goheen",4,"Jillian Kulzer","Stillwater",null,null,4,"Molly Goheen","Stillwater"]
["Hannah Bliss","Stillwater",0.251190917722087,11,5,5,"Stillwater","Hannah Bliss",5,"Alexis Montgomery","Stillwater",null,null,5,"Hannah Bliss","Stillwater"]
["Kyra Will","Stillwater",0.035946109662945425,3,6,6,"Stillwater","Kyra Will",6,"Bella Formico","Stillwater",null,null,6,"Kyra Will","Stillwater"]
["Anika Wright","Stillwater",0.10680927180532684,7,7,7,"Stillwater","Anika Wright",7,"Anika Wright","Stillwater",null,null,7,"Anika Wright","Stillwater"]
["Mikaela Crosby","Osseo-Maple Grove",0.4892185865553218,19,8,8,"Osseo-Maple Grove","Mikaela Crosby",8,"Molly Goheen","Stillwater",null,null,8,"Mikaela Crosby","Osseo-Maple Grove"]
["Annika Desphande","Osseo-Maple Grove",0.3687972754224331,14,9,9,"Osseo-Maple Grove","Annika Desphande",9,"Chloe Knuteson","Stillwater",null,null,9,"Annika Desphande","Osseo-Maple Grove"]
{"$rows_left_out":142}
{"sheet":"Schools","index":7,"n_rows":15,"n_cols":1,"rows_kept":15,"hidden":true}
["List of Schools:"]
["Blake"]
["Bloomington"]
["Columbia Heights"]
["Eden Prairie"]
["Edina"]
["Forest Lake"]
["Hopkins"]
["Itasca"]
["Osseo-Maple Grove"]
{"$rows_left_out":6}
{"sheet":"Official Draw","index":8,"n_rows":151,"n_cols":4,"rows_kept":151}
[]
[null,{"$f":"Draw!I1","v":"Draw #"},{"$f":"Draw!J1","v":"Name"},{"$f":"Draw!K1","v":"School"}]
[null,1,"Leigha Kraft","Stillwater"]
[null,2,"Erin Wurgler","Stillwater"]
[null,3,"Kati Knox","Osseo-Maple Grove"]
[null,4,"Molly Goheen","Stillwater"]
[null,5,"Hannah Bliss","Stillwater"]
[null,6,"Kyra Will","Stillwater"]
[null,7,"Anika Wright","Stillwater"]
[null,8,"Mikaela Crosby","Osseo-Maple Grove"]
{"$rows_left_out":142}
{"sheet":"Meet Results","index":9,"n_rows":150,"n_cols":23,"rows_kept":150}
[]
[{"$nulls":3},"Stillwater",{"$f":"SUMIF($F5:$G24,D2,$H5:$H24)","v":0},"Osseo-Maple Grove",{"$f":"SUMIF($F5:$G24,F2,$H5:$H24)","v":0},{"$nulls":3},"Edina",{"$f":"SUMIF($M5:$N24,K2,$O5:$O24)","v":8},"Edina",{"$f":"SUMIF($M5:$N24,M2,$O5:$O24)","v":8},{"$nulls":3},"Hopkins",{"$f":"SUMIF($T5:$U24,R2,$V5:$V24)","v":8},"Hopkins",{"$f":"SUMIF($T5:$U24,T2,$V5:$V24)","v":8}]
[{"$nulls":3}," Total Score",{"$nulls":6}," Total Score",{"$nulls":6}," Total Score"]
[{"$nulls":3},"#","Swimmer","School","Total","SCORE","PLACE",null,"#","Swimmer","School","Total","SCORE","PLACE",null,"#","Swimmer","School","Total","SCORE","PLACE"]
[{"$nulls":3},2,"Student Names:","Hopkins",{"v":0,"d":"0.00000"},{"$f":"IF(ISNA(VLOOKUP(I5,Totals!$AX$3:$AY$102,2,FALSE)),\"\",VLOOKUP(I5,Totals!$AX$3:$AY$102,2,FALSE))","v":8},{"$f":"IF(ISNA(RANK(G5,G$5:G$150)),\"\",RANK(G5,G$5:G$150))","v":1},null,1,"Student Names:","Edina",{"v":0,"d":"0.00000"},{"$f":"IF(ISNA(VLOOKUP(P5,Totals!$AX$3:$AY$102,2,FALSE)),\"\",VLOOKUP(P5,Totals!$AX$3:$AY$102,2,FALSE))","v":8},{"$f":"IF(ISNA(RANK(N5,N$5:N$150)),\"\",RANK(N5,N$5:N$150))","v":1},null,2,"Student Names:","Hopkins",{"v":0,"d":"0.00000"},{"$f":"IF(ISNA(VLOOKUP(W5,Totals!$AX$3:$AY$102,2,FALSE)),\"\",VLOOKUP(W5,Totals!$AX$3:$AY$102,2,FALSE))","v":8},{"$f":"IF(ISNA(RANK(U5,U$5:U$150)),\"\",RANK(U5,U$5:U$150))","v":1}]
[{"$nulls":3},1,"Student Names:","Edina",{"v":0,"d":"0.00000"},{"$f":"IF(ISNA(VLOOKUP(I6,Totals!$AX$3:$AY$102,2,FALSE)),\"\",VLOOKUP(I6,Totals!$AX$3:$AY$102,2,FALSE))","v":8},{"$f":"IF(G6=G5,I5,IF(ISNA(RANK(G6,G$5:G$150)),\"\",RANK(G6,G$5:G$150)))","v":1},{"$nulls":5},{"$f":"IF(ISNA(VLOOKUP(P6,Totals!$AX$3:$AY$102,2,FALSE)),\"\",VLOOKUP(P6,Totals!$AX$3:$AY$102,2,FALSE))","v":8},{"$f":"IF(ISNA(RANK(N6,N$5:N$150)),\"\",RANK(N6,N$5:N$150))","v":1},{"$nulls":5},{"$f":"IF(ISNA(VLOOKUP(W6,Totals!$AX$3:$AY$102,2,FALSE)),\"\",VLOOKUP(W6,Totals!$AX$3:$AY$102,2,FALSE))","v":8},{"$f":"IF(ISNA(RANK(U6,U$5:U$150)),\"\",RANK(U6,U$5:U$150))","v":1}]
[{"$nulls":7},{"$f":"IF(ISNA(VLOOKUP(I7,Totals!$AX$3:$AY$102,2,FALSE)),\"\",VLOOKUP(I7,Totals!$AX$3:$AY$102,2,FALSE))","v":8},{"$f":"IF(G7=G6,I6,IF(ISNA(RANK(G7,G$5:G$150)),\"\",RANK(G7,G$5:G$150)))","v":1},{"$nulls":5},{"$f":"IF(ISNA(VLOOKUP(P7,Totals!$AX$3:$AY$102,2,FALSE)),\"\",VLOOKUP(P7,Totals!$AX$3:$AY$102,2,FALSE))","v":8},1,{"$nulls":5},{"$f":"IF(ISNA(VLOOKUP(W7,Totals!$AX$3:$AY$102,2,FALSE)),\"\",VLOOKUP(W7,Totals!$AX$3:$AY$102,2,FALSE))","v":8},1]
[{"$nulls":7},{"$f":"IF(ISNA(VLOOKUP(I8,Totals!$AX$3:$AY$102,2,FALSE)),\"\",VLOOKUP(I8,Totals!$AX$3:$AY$102,2,FALSE))","v":8},1,{"$nulls":5},{"$f":"IF(ISNA(VLOOKUP(P8,Totals!$AX$3:$AY$102,2,FALSE)),\"\",VLOOKUP(P8,Totals!$AX$3:$AY$102,2,FALSE))","v":8},1,{"$nulls":5},{"$f":"IF(ISNA(VLOOKUP(W8,Totals!$AX$3:$AY$102,2,FALSE)),\"\",VLOOKUP(W8,Totals!$AX$3:$AY$102,2,FALSE))","v":8},1]
[{"$nulls":7},{"$f":"IF(ISNA(VLOOKUP(I9,Totals!$AX$3:$AY$102,2,FALSE)),\"\",VLOOKUP(I9,Totals!$AX$3:$AY$102,2,FALSE))","v":8},1,{"$nulls":5},{"$f":"IF(ISNA(VLOOKUP(P9,Totals!$AX$3:$AY$102,2,FALSE)),\"\",VLOOKUP(P9,Totals!$AX$3:$AY$102,2,FALSE))","v":8},1,{"$nulls":5},{"$f":"IF(ISNA(VLOOKUP(W9,Totals!$AX$3:$AY$102,2,FALSE)),\"\",VLOOKUP(W9,Totals!$AX$3:$AY$102,2,FALSE))","v":8},1]
[{"$nulls":7},{"$f":"IF(ISNA(VLOOKUP(I10,Totals!$AX$3:$AY$102,2,FALSE)),\"\",VLOOKUP(I10,Totals!$AX$3:$AY$102,2,FALSE))","v":8},1,{"$nulls":5},{"$f":"IF(ISNA(VLOOKUP(P10,Totals!$AX$3:$AY$102,2,FALSE)),\"\",VLOOKUP(P10,Totals!$AX$3:$AY$102,2,FALSE))","v":8},1,{"$nulls":5},{"$f":"IF(ISNA(VLOOKUP(W10,Totals!$AX$3:$AY$102,2,FALSE)),\"\",VLOOKUP(W10,Totals!$AX$3:$AY$102,2,FALSE))","v":8},1]
{"$rows_left_out":140}