{"text_format":"1","workbook":"xlsx","n_sheets":10,"sheets":["Student Entry","Fig 1 Ballet Leg","Fig 2 Barracuda","Fig 3 Neptunus","Fig 4 Walkover","Totals","Draw","Schools","Official Draw","Meet Results"],"not_rendered":{"charts":0,"images":1,"macros":1,"external_links":0,"defined_names":4,"comments":0,"pivot_tables":3},"unopened":[],"bounds":{"document_bytes":16777216,"sheet_cells":100000,"rows_first":2000,"rows_last":500,"rows_between":2000,"halvings":0,"cell_chars":16384,"cell_head_chars":4096},"cells_cut":0,"cells_raw":0,"read":"whole","date_system":"1900"}

{"sheet":"Student Entry","index":0,"n_rows":22,"n_cols":3,"rows_kept":22,"cut":false,"hidden":false,"merged":[[0,0,0,2]]}
["Student Entry"]
["School # 1 Name:","School # 2 Name:","School # 3 Name:"]
["Forest Lake","Osseo-Maple Grove"]
["Student Names:","Student Names:","Student Names:"]
["Paige Anderson","Heather Breidenbach"]
["Emma Armitage","Carolin LaBord"]
["Ariel Ball","Katelyn Molin"]
["Lizzy Hentges","Katherine Olsen"]
["Heidi Hyrkas","Alexandra Trudeau"]
["Johanna Livermore","Anneke DeLooze"]
{"$rows_left_out":13}
{"sheet":"Fig 1 Ballet Leg","index":1,"n_rows":150,"n_cols":9,"rows_kept":150,"cut":false,"hidden":false,"merged":[]}
[null,"Figure #1:","101 R/L Ballet Leg, single, *right or *left"]
["#","Degree of Difficulty","Judge 1","Judge 2","Judge 3","Judge 4","Judge 5","Score","Penalty"]
[{"$f":"IF(Draw!E2=0,\"\",Draw!E2)","v":1},1.6,47,51,51,54,51,{"$f":"IF(A3=\"\",\"\",(IF(F3>0,(SUM(C3:G3)-MAX(C3:G3)-MIN(C3:G3))/3,SUM(C3:E3)/3))*B3/7.6)","v":10.736842105263159}]
[{"$f":"IF(Draw!E3=0,\"\",Draw!E3)","v":2},{"$f":"IF(A4=\"\",\"\",B$3)","v":1.6},50,53,53,54,53,{"$f":"IF(A4=\"\",\"\",(IF(F4>0,(SUM(C4:G4)-MAX(C4:G4)-MIN(C4:G4))/3,SUM(C4:E4)/3))*B4/7.6)","v":11.157894736842108}]
[{"$f":"IF(Draw!E4=0,\"\",Draw!E4)","v":3},1.6,49,46,48,49,49,10.245614035087721]
[{"$f":"IF(Draw!E5=0,\"\",Draw!E5)","v":4},{"$f":"IF(A6=\"\",\"\",B$3)","v":1.6},"x","x","x","x","x",0]
[{"$f":"IF(Draw!E6=0,\"\",Draw!E6)","v":5},1.6,52,50,50,51,52,{"$f":"IF(A7=\"\",\"\",(IF(F7>0,(SUM(C7:G7)-MAX(C7:G7)-MIN(C7:G7))/3,SUM(C7:E7)/3))*B7/7.6)","v":10.736842105263159}]
[{"$f":"IF(Draw!E7=0,\"\",Draw!E7)","v":6},1.6,45,47,45,47,46,9.6842105263157912]
[{"$f":"IF(Draw!E8=0,\"\",Draw!E8)","v":7},1.6,57,51,53,53,50,11.017543859649125]
[{"$f":"IF(Draw!E9=0,\"\",Draw!E9)","v":8},1.6,45,48,47,49,45,9.8245614035087723]
{"$rows_left_out":141}
{"sheet":"Fig 2 Barracuda","index":2,"n_rows":150,"n_cols":9,"rows_kept":150,"cut":false,"hidden":false,"merged":[[0,2,0,6]]}
[null,"Figure #2:"," 301 Barracuda"]
["#","Degree of Difficulty","Judge 1","Judge 2","Judge 3","Judge 4","Judge 5","Score","Penalty"]
[{"$f":"IF(Draw!E2=0,\"\",Draw!E2)","v":1},2,54,55,53,54,51,{"$f":"(IF(F3>0,(SUM(C3:G3)-MAX(C3:G3)-MIN(C3:G3))/3,SUM(C3:E3)/3))*B3/7.6","v":14.12280701754386}]
[{"$f":"IF(Draw!E3=0,\"\",Draw!E3)","v":2},{"$f":"IF(A4=\"\",\"\",B$3)","v":2},43,41,41,41,41,{"$f":"IF(A4=\"\",\"\",(IF(F4>0,(SUM(C4:G4)-MAX(C4:G4)-MIN(C4:G4))/3,SUM(C4:E4)/3))*B4/7.6)","v":10.789473684210527}]
[{"$f":"IF(Draw!E4=0,\"\",Draw!E4)","v":3},2,47,39,44,44,48,{"$f":"IF(A5=\"\",\"\",(IF(F5>0,(SUM(C5:G5)-MAX(C5:G5)-MIN(C5:G5))/3,SUM(C5:E5)/3))*B5/7.6)","v":11.842105263157896}]
[{"$f":"IF(Draw!E5=0,\"\",Draw!E5)","v":4},{"$f":"IF(A6=\"\",\"\",B$3)","v":2},"x","x","x","x","x",{"$f":"IF(A6=\"\",\"\",(IF(F6>0,(SUM(C6:G6)-MAX(C6:G6)-MIN(C6:G6))/3,SUM(C6:E6)/3))*B6/7.6)","v":0}]
[{"$f":"IF(Draw!E6=0,\"\",Draw!E6)","v":5},2,52,49,48,46,47,12.631578947368421]
[{"$f":"IF(Draw!E7=0,\"\",Draw!E7)","v":6},2,45,41,42,39,48,11.228070175438596]
[{"$f":"IF(Draw!E8=0,\"\",Draw!E8)","v":7},2,49,53,46,48,50,12.894736842105264]
[{"$f":"IF(Draw!E9=0,\"\",Draw!E9)","v":8},2,44,38,38,39,39,10.175438596491228]
{"$rows_left_out":141}
{"sheet":"Fig 3 Neptunus","index":3,"n_rows":150,"n_cols":9,"rows_kept":150,"cut":false,"hidden":false,"merged":[[0,2,0,6]]}
[null,"Figure #3:","344 Neptunus"]
["#","Degree of Difficulty","Judge 1","Judge 2","Judge 3","Judge 4","Judge 5","Score","Penalty"]
[{"$f":"IF(Draw!E2=0,\"\",Draw!E2)","v":1},1.8,50,49,46,null,null,{"$f":"(IF(F3>0,(SUM(C3:G3)-MAX(C3:G3)-MIN(C3:G3))/3,SUM(C3:E3)/3))*B3/7.6","v":11.447368421052632}]
[{"$f":"IF(Draw!E3=0,\"\",Draw!E3)","v":2},{"$f":"IF(A4=\"\",\"\",B$3)","v":1.8},47,44,38,null,null,{"$f":"IF(A4=\"\",\"\",(IF(F4>0,(SUM(C4:G4)-MAX(C4:G4)-MIN(C4:G4))/3,SUM(C4:E4)/3))*B4/7.6)","v":10.184210526315791}]
[{"$f":"IF(Draw!E4=0,\"\",Draw!E4)","v":3},1.8,40,46,35,null,null,{"$f":"IF(A5=\"\",\"\",(IF(F5>0,(SUM(C5:G5)-MAX(C5:G5)-MIN(C5:G5))/3,SUM(C5:E5)/3))*B5/7.6)","v":9.5526315789473699}]
[{"$f":"IF(Draw!E5=0,\"\",Draw!E5)","v":4},{"$f":"IF(A6=\"\",\"\",B$3)","v":1.8},"x","x","x","x","x",{"$f":"IF(A6=\"\",\"\",(IF(F6>0,(SUM(C6:G6)-MAX(C6:G6)-MIN(C6:G6))/3,SUM(C6:E6)/3))*B6/7.6)","v":0}]
[{"$f":"IF(Draw!E6=0,\"\",Draw!E6)","v":5},1.8,42,43,40,null,null,9.8684210526315788]
[{"$f":"IF(Draw!E7=0,\"\",Draw!E7)","v":6},1.8,45,44,38,null,null,10.026315789473685]
[{"$f":"IF(Draw!E8=0,\"\",Draw!E8)","v":7},1.8,47,49,47,null,null,11.289473684210526]
[{"$f":"IF(Draw!E9=0,\"\",Draw!E9)","v":8},1.8,46,41,40,null,null,10.026315789473685]
{"$rows_left_out":141}
{"sheet":"Fig 4 Walkover","index":4,"n_rows":150,"n_cols":10,"rows_kept":150,"cut":false,"hidden":false,"merged":[[0,3,0,7]]}
[null,"Figure #4:",null,"360 Walkover Front"]
["#","Degree of Difficulty","Figure","Judge 1","Judge 2","Judge 3","Judge 4","Judge 5","Score","Penalty"]
[{"$f":"IF(Draw!E2=0,\"\",Draw!E2)","v":1},2.1,null,52,53,52,null,null,{"$f":"(IF(G3>0,(SUM(D3:H3)-MAX(D3:H3)-MIN(D3:H3))/3,SUM(D3:F3)/3))*B3/7.6","v":14.460526315789474}]
[{"$f":"IF(Draw!E3=0,\"\",Draw!E3)","v":2},{"$f":"IF(A4=\"\",\"\",B$3)","v":2.1},null,53,54,53,null,null,{"$f":"IF(B4=\"\",\"\",(IF(G4>0,(SUM(D4:H4)-MAX(D4:H4)-MIN(D4:H4))/3,SUM(D4:F4)/3))*B4/7.6)","v":14.736842105263161}]
[{"$f":"IF(Draw!E4=0,\"\",Draw!E4)","v":3},2.1,null,50,48,51,null,null,{"$f":"IF(B5=\"\",\"\",(IF(G5>0,(SUM(D5:H5)-MAX(D5:H5)-MIN(D5:H5))/3,SUM(D5:F5)/3))*B5/7.6)","v":13.723684210526317}]
[{"$f":"IF(Draw!E5=0,\"\",Draw!E5)","v":4},{"$f":"IF(A6=\"\",\"\",B$3)","v":2.1},null,"x","x","x","x","x",0]
[{"$f":"IF(Draw!E6=0,\"\",Draw!E6)","v":5},2.1,null,46,48,46,null,null,{"$f":"IF(B7=\"\",\"\",(IF(G7>0,(SUM(D7:H7)-MAX(D7:H7)-MIN(D7:H7))/3,SUM(D7:F7)/3))*B7/7.6)","v":12.894736842105264}]
[{"$f":"IF(Draw!E7=0,\"\",Draw!E7)","v":6},2.1,null,43,43,44,null,null,11.973684210526319]
[{"$f":"IF(Draw!E8=0,\"\",Draw!E8)","v":7},2.1,null,52,53,52,null,null,14.460526315789474]
[{"$f":"IF(Draw!E9=0,\"\",Draw!E9)","v":8},2.1,null,49,48,48,null,null,13.35526315789474]
{"$rows_left_out":141}
{"sheet":"Totals","index":5,"n_rows":151,"n_cols":51,"rows_kept":151,"cut":false,"hidden":false,"merged":[]}
["#","Swimmer","School","Total Score","Place","Figure 1","Figure 2","Figure 3","Figure 4","Penalties","Score"]
[{"$f":"IF(Draw!E5=0,\"\",Draw!E5)","v":4},"Carolin LaBord","Osseo-Maple Grove",{"$f":"IF($A2=\"\",\"\",SUM(F2:I2)-J2)","v":0},{"$f":"IF($A2=\"\",\"\",RANK(D2,D$2:D$150))","v":30},{"$f":"IF($A2=\"\",\"\",'Fig 1 Ballet Leg'!H6)","v":0},{"$f":"IF($A2=\"\",\"\",'Fig 2 Barracuda'!H6)","v":0},{"$f":"IF($A2=\"\",\"\",'Fig 3 Neptunus'!H6)","v":0},{"$f":"IF($A2=\"\",\"\",'Fig 4 Walkover'!I6)","v":0},{"$f":"IF($A2=\"\",\"\",'Fig 1 Ballet Leg'!I6+'Fig 2 Barracuda'!I6+'Fig 3 Neptunus'!I6+'Fig 4 Walkover'!J6)","v":0},{"$f":"IF($A2=\"\",\"\",IF(A2=\"\",\"\",VLOOKUP(E2,AX$3:AY$102,2,FALSE)))","v":0}]
[{"$f":"IF(Draw!E19=0,\"\",Draw!E19)","v":18},"Allison Hannann","Osseo-Maple Grove",{"$f":"IF($A3=\"\",\"\",SUM(F3:I3)-J3)","v":0},{"$f":"IF($A3=\"\",\"\",RANK(D3,D$2:D$150))","v":30},{"$f":"IF($A3=\"\",\"\",'Fig 1 Ballet Leg'!H20)","v":0},{"$f":"IF($A3=\"\",\"\",'Fig 2 Barracuda'!H20)","v":0},{"$f":"IF($A3=\"\",\"\",'Fig 3 Neptunus'!H20)","v":0},{"$f":"IF($A3=\"\",\"\",'Fig 4 Walkover'!I20)","v":0},{"$f":"IF($A3=\"\",\"\",'Fig 1 Ballet Leg'!I20+'Fig 2 Barracuda'!I20+'Fig 3 Neptunus'!I20+'Fig 4 Walkover'!J20)","v":0},{"$f":"IF($A3=\"\",\"\",IF(A3=\"\",\"\",VLOOKUP(E3,AX$3:AY$102,2,FALSE)))","v":0},null,null,null,null,null,null,null,null,null,null,null,null,null,null,null,null,null,null,null,null,null,null,null,null,null,null,null,null,null,null,null,null,null,null,null,null,null,null,1,8]
[{"$f":"IF(Draw!E29=0,\"\",Draw!E29)","v":28},"Rachel Knox","Osseo-Maple Grove",{"$f":"IF($A4=\"\",\"\",SUM(F4:I4)-J4)","v":0},{"$f":"IF($A4=\"\",\"\",RANK(D4,D$2:D$150))","v":30},{"$f":"IF($A4=\"\",\"\",'Fig 1 Ballet Leg'!H30)","v":0},{"$f":"IF($A4=\"\",\"\",'Fig 2 Barracuda'!H30)","v":0},{"$f":"IF($A4=\"\",\"\",'Fig 3 Neptunus'!H30)","v":0},{"$f":"IF($A4=\"\",\"\",'Fig 4 Walkover'!I30)","v":0},{"$f":"IF($A4=\"\",\"\",'Fig 1 Ballet Leg'!I30+'Fig 2 Barracuda'!I30+'Fig 3 Neptunus'!I30+'Fig 4 Walkover'!J30)","v":0},{"$f":"IF($A4=\"\",\"\",IF(A4=\"\",\"\",VLOOKUP(E4,AX$3:AY$102,2,FALSE)))","v":0},null,null,null,null,null,null,null,null,null,null,null,null,null,null,null,null,null,null,null,null,null,null,null,null,null,null,null,null,null,null,null,null,null,null,null,null,null,null,2,6]
[{"$f":"IF(Draw!E34=0,\"\",Draw!E34)","v":33},"Anneke DeLooze","Osseo-Maple Grove",{"$f":"IF($A5=\"\",\"\",SUM(F5:I5)-J5)","v":0},{"$f":"IF($A5=\"\",\"\",RANK(D5,D$2:D$150))","v":30},{"$f":"IF($A5=\"\",\"\",'Fig 1 Ballet Leg'!H35)","v":0},{"$f":"IF($A5=\"\",\"\",'Fig 2 Barracuda'!H35)","v":0},{"$f":"IF($A5=\"\",\"\",'Fig 3 Neptunus'!H35)","v":0},{"$f":"IF($A5=\"\",\"\",'Fig 4 Walkover'!I35)","v":0},{"$f":"IF($A5=\"\",\"\",'Fig 1 Ballet Leg'!I35+'Fig 2 Barracuda'!I35+'Fig 3 Neptunus'!I35+'Fig 4 Walkover'!J35)","v":0},{"$f":"IF($A5=\"\",\"\",IF(A5=\"\",\"\",VLOOKUP(E5,AX$3:AY$102,2,FALSE)))","v":0},null,null,null,null,null,null,null,null,null,null,null,null,null,null,null,null,null,null,null,null,null,null,null,null,null,null,null,null,null,null,null,null,null,null,null,null,null,null,3,5]
[{"$f":"IF(Draw!E14=0,\"\",Draw!E14)","v":13},"Rachel Milbauer","Forest Lake",{"$f":"IF($A6=\"\",\"\",SUM(F6:I6)-J6)","v":38.096491228070178},{"$f":"IF($A6=\"\",\"\",RANK(D6,D$2:D$150))","v":29},{"$f":"IF($A6=\"\",\"\",'Fig 1 Ballet Leg'!H15)","v":9.6842105263157912},{"$f":"IF($A6=\"\",\"\",'Fig 2 Barracuda'!H15)","v":9.1228070175438596},{"$f":"IF($A6=\"\",\"\",'Fig 3 Neptunus'!H15)","v":9.1578947368421044},{"$f":"IF($A6=\"\",\"\",'Fig 4 Walkover'!I15)","v":10.131578947368421},{"$f":"IF($A6=\"\",\"\",'Fig 1 Ballet Leg'!I15+'Fig 2 Barracuda'!I15+'Fig 3 Neptunus'!I15+'Fig 4 Walkover'!J15)","v":0},{"$f":"IF($A6=\"\",\"\",IF(A6=\"\",\"\",VLOOKUP(E6,AX$3:AY$102,2,FALSE)))","v":0},null,null,null,null,null,null,null,null,null,null,null,null,null,null,null,null,null,null,null,null,null,null,null,null,null,null,null,null,null,null,null,null,null,null,null,null,null,null,4,4]
[{"$f":"IF(Draw!E23=0,\"\",Draw!E23)","v":22},"Kelly Sullivan","Forest Lake",{"$f":"IF($A7=\"\",\"\",SUM(F7:I7)-J7)","v":40.44736842105263},{"$f":"IF($A7=\"\",\"\",RANK(D7,D$2:D$150))","v":28},{"$f":"IF($A7=\"\",\"\",'Fig 1 Ballet Leg'!H24)","v":9.4035087719298254},{"$f":"IF($A7=\"\",\"\",'Fig 2 Barracuda'!H24)","v":9.9122807017543852},{"$f":"IF($A7=\"\",\"\",'Fig 3 Neptunus'!H24)","v":9.1578947368421044},{"$f":"IF($A7=\"\",\"\",'Fig 4 Walkover'!I24)","v":11.973684210526319},{"$f":"IF($A7=\"\",\"\",'Fig 1 Ballet Leg'!I24+'Fig 2 Barracuda'!I24+'Fig 3 Neptunus'!I24+'Fig 4 Walkover'!J24)","v":0},{"$f":"IF($A7=\"\",\"\",IF(A7=\"\",\"\",VLOOKUP(E7,AX$3:AY$102,2,FALSE)))","v":0},null,null,null,null,null,null,null,null,null,null,null,null,null,null,null,null,null,null,null,null,null,null,null,null,null,null,null,null,null,null,null,null,null,null,null,null,null,null,5,3]
[{"$f":"IF(Draw!E30=0,\"\",Draw!E30)","v":29},"Emma Armitage","Forest Lake",{"$f":"IF($A8=\"\",\"\",SUM(F8:I8)-J8)","v":41.328947368421055},{"$f":"IF($A8=\"\",\"\",RANK(D8,D$2:D$150))","v":27},{"$f":"IF($A8=\"\",\"\",'Fig 1 Ballet Leg'!H31)","v":9.6140350877192979},{"$f":"IF($A8=\"\",\"\",'Fig 2 Barracuda'!H31)","v":9.3859649122807021},{"$f":"IF($A8=\"\",\"\",'Fig 3 Neptunus'!H31)","v":9.7105263157894743},{"$f":"IF($A8=\"\",\"\",'Fig 4 Walkover'!I31)","v":12.618421052631581},{"$f":"IF($A8=\"\",\"\",'Fig 1 Ballet Leg'!I31+'Fig 2 Barracuda'!I31+'Fig 3 Neptunus'!I31+'Fig 4 Walkover'!J31)","v":0},{"$f":"IF($A8=\"\",\"\",IF(A8=\"\",\"\",VLOOKUP(E8,AX$3:AY$102,2,FALSE)))","v":0},null,null,null,null,null,null,null,null,null,null,null,null,null,null,null,null,null,null,null,null,null,null,null,null,null,null,null,null,null,null,null,null,null,null,null,null,null,null,6,2]
[{"$f":"IF(Draw!E28=0,\"\",Draw!E28)","v":27},"Emily Honnold","Osseo-Maple Grove",{"$f":"IF($A9=\"\",\"\",SUM(F9:I9)-J9)","v":41.798245614035096},{"$f":"IF($A9=\"\",\"\",RANK(D9,D$2:D$150))","v":26},{"$f":"IF($A9=\"\",\"\",'Fig 1 Ballet Leg'!H29)","v":9.4035087719298254},{"$f":"IF($A9=\"\",\"\",'Fig 2 Barracuda'!H29)","v":8.9473684210526319},{"$f":"IF($A9=\"\",\"\",'Fig 3 Neptunus'!H29)","v":10.184210526315791},{"$f":"IF($A9=\"\",\"\",'Fig 4 Walkover'!I29)","v":13.263157894736844},{"$f":"IF($A9=\"\",\"\",'Fig 1 Ballet Leg'!I29+'Fig 2 Barracuda'!I29+'Fig 3 Neptunus'!I29+'Fig 4 Walkover'!J29)","v":0},{"$f":"IF($A9=\"\",\"\",IF(A9=\"\",\"\",VLOOKUP(E9,AX$3:AY$102,2,FALSE)))","v":0},null,null,null,null,null,null,null,null,null,null,null,null,null,null,null,null,null,null,null,null,null,null,null,null,null,null,null,null,null,null,null,null,null,null,null,null,null,null,7,1]
[{"$f":"IF(Draw!E21=0,\"\",Draw!E21)","v":20},"Lizzy Hentges","Forest Lake",{"$f":"IF($A10=\"\",\"\",SUM(F10:I10)-J10)","v":41.916666666666671},{"$f":"IF($A10=\"\",\"\",RANK(D10,D$2:D$150))","v":25},{"$f":"IF($A10=\"\",\"\",'Fig 1 Ballet Leg'!H22)","v":10.035087719298247},{"$f":"IF($A10=\"\",\"\",'Fig 2 Barracuda'!H22)","v":10.263157894736842},{"$f":"IF($A10=\"\",\"\",'Fig 3 Neptunus'!H22)","v":9.0000000000000018},{"$f":"IF($A10=\"\",\"\",'Fig 4 Walkover'!I22)","v":12.618421052631581},{"$f":"IF($A10=\"\",\"\",'Fig 1 Ballet Leg'!I22+'Fig 2 Barracuda'!I22+'Fig 3 Neptunus'!I22+'Fig 4 Walkover'!J22)","v":0},{"$f":"IF($A10=\"\",\"\",IF(A10=\"\",\"\",VLOOKUP(E10,AX$3:AY$102,2,FALSE)))","v":0},null,null,null,null,null,null,null,null,null,null,null,null,null,null,null,null,null,null,null,null,null,null,null,null,null,null,null,null,null,null,null,null,null,null,null,null,null,null,8,0]
{"$rows_left_out":142}
{"sheet":"Draw","index":6,"n_rows":151,"n_cols":16,"rows_kept":151,"cut":false,"hidden":true,"merged":[]}
[1,"Bloomington",{"$f":"RAND()","v":0.57858918687150573},null,null,null,"School","Name","Draw #","Name","School"]
["Jenna Stockinger","Forest Lake",{"$f":"RAND()","v":2.014990781985071E-2},{"$f":"IF(ISNA(RANK(C2,C$2:C$150,1)),\"\",RANK(C2,C$2:C$150,1))","v":2},{"$f":"IF(B2<>\"\",F2,\"\")","v":1},1,{"$f":"B2","v":"Forest Lake"},{"$f":"A2","v":"Jenna Stockinger"},{"$f":"E2","v":1},{"$f":"IF(ISNA(VLOOKUP(I2,D$2:H$150,5,FALSE)),\"\",VLOOKUP(I2,D$2:H$150,5,FALSE))","v":"Madison Peters"},{"$f":"IF(ISNA(VLOOKUP(I2,D$2:G$150,4,FALSE)),\"\",VLOOKUP(I2,D$2:G$150,4,FALSE))","v":"Osseo-Maple Grove"},null,null,1,"Jenna Stockinger","Forest Lake"]
["Ellery Mason","Osseo-Maple Grove",0.39893861425029808,{"$f":"IF(ISNA(RANK(C3,C$2:C$150,1)),\"\",RANK(C3,C$2:C$150,1))","v":14},{"$f":"IF(B3<>\"\",F3,\"\")","v":2},2,{"$f":"B3","v":"Osseo-Maple Grove"},{"$f":"A3","v":"Ellery Mason"},{"$f":"E3","v":2},{"$f":"IF(ISNA(VLOOKUP(I3,D$2:H$150,5,FALSE)),\"\",VLOOKUP(I3,D$2:H$150,5,FALSE))","v":"Jenna Stockinger"},{"$f":"IF(ISNA(VLOOKUP(I3,D$2:G$150,4,FALSE)),\"\",VLOOKUP(I3,D$2:G$150,4,FALSE))","v":"Forest Lake"},null,null,2,"Ellery Mason","Osseo-Maple Grove"]
["Katherine Hildebrandt","Osseo-Maple Grove",0.32821894260372186,12,3,3,"Osseo-Maple Grove","Katherine Hildebrandt",3,"Katelyn Molin","Osseo-Maple Grove",null,null,3,"Katherine Hildebrandt","Osseo-Maple Grove"]
["Carolin LaBord","Osseo-Maple Grove",0.97192638945512244,30,4,4,"Osseo-Maple Grove","Carolin LaBord",4,"","",null,null,4,"Carolin LaBord","Osseo-Maple Grove"]
["Indy Walstrom","Forest Lake",0.44141604796158318,17,5,5,"Forest Lake","Indy Walstrom",5,"","",null,null,5,"Indy Walstrom","Forest Lake"]
["Zoe Scholl","Forest Lake",0.42104314836922008,15,6,6,"Forest Lake","Zoe Scholl",6,"Lizzy Hentges","Forest Lake",null,null,6,"Zoe Scholl","Forest Lake"]
["Alexandra Trudeau","Osseo-Maple Grove",0.43358858681488599,16,7,7,"Osseo-Maple Grove","Alexandra Trudeau",7,"Margo Prentice","Osseo-Maple Grove",null,null,7,"Alexandra Trudeau","Osseo-Maple Grove"]
["Lydia Zimmerman","Forest Lake",0.74844755376771877,25,8,8,"Forest Lake","Lydia Zimmerman",8,"Rachel Milbauer","Forest Lake",null,null,8,"Lydia Zimmerman","Forest Lake"]
["Margo Prentice","Osseo-Maple Grove",0.20838046161556933,7,9,9,"Osseo-Maple Grove","Margo Prentice",9,"","",null,null,9,"Margo Prentice","Osseo-Maple Grove"]
{"$rows_left_out":142}
{"sheet":"Schools","index":7,"n_rows":14,"n_cols":1,"rows_kept":14,"cut":false,"hidden":true,"merged":[]}
["List of Schools:"]
["Bloomington"]
["Columbia Heights"]
["Eden Prairie"]
["Edina"]
["Forest Lake"]
["Hopkins"]
["Itasca"]
["Osseo-Maple Grove"]
["Prior Lake"]
{"$rows_left_out":5}
{"sheet":"Official Draw","index":8,"n_rows":151,"n_cols":4,"rows_kept":151,"cut":false,"hidden":false,"merged":[]}
[]
[null,{"$f":"Draw!I1","v":"Draw #"},{"$f":"Draw!J1","v":"Name"},{"$f":"Draw!K1","v":"School"}]
[null,{"$f":"Draw!N2","v":1},{"$f":"Draw!O2","v":"Jenna Stockinger"},{"$f":"Draw!P2","v":"Forest Lake"}]
[null,{"$f":"Draw!N3","v":2},{"$f":"Draw!O3","v":"Ellery Mason"},{"$f":"Draw!P3","v":"Osseo-Maple Grove"}]
[null,{"$f":"Draw!N4","v":3},{"$f":"Draw!O4","v":"Katherine Hildebrandt"},{"$f":"Draw!P4","v":"Osseo-Maple Grove"}]
[null,{"$f":"Draw!N5","v":4},{"$f":"Draw!O5","v":"Carolin LaBord"},{"$f":"Draw!P5","v":"Osseo-Maple Grove"}]
[null,{"$f":"Draw!N6","v":5},{"$f":"Draw!O6","v":"Indy Walstrom"},{"$f":"Draw!P6","v":"Forest Lake"}]
[null,{"$f":"Draw!N7","v":6},{"$f":"Draw!O7","v":"Zoe Scholl"},{"$f":"Draw!P7","v":"Forest Lake"}]
[null,{"$f":"Draw!N8","v":7},{"$f":"Draw!O8","v":"Alexandra Trudeau"},{"$f":"Draw!P8","v":"Osseo-Maple Grove"}]
[null,{"$f":"Draw!N9","v":8},{"$f":"Draw!O9","v":"Lydia Zimmerman"},{"$f":"Draw!P9","v":"Forest Lake"}]
{"$rows_left_out":142}
{"sheet":"Meet Results","index":9,"n_rows":150,"n_cols":23,"rows_kept":150,"cut":false,"hidden":false,"merged":[]}
[]
[null,null,null,"Forest Lake",{"$f":"SUMIF($F5:$G24,D2,$H5:$H24)","v":17},"Osseo-Maple Grove",{"$f":"SUMIF($F5:$G24,F2,$H5:$H24)","v":12},null,null,null,"Edina",{"$f":"SUMIF($M5:$N24,K2,$O5:$O24)","v":0},"Edina",{"$f":"SUMIF($M5:$N24,M2,$O5:$O24)","v":0},null,null,null,"Edina",{"$f":"SUMIF($T5:$U24,R2,$V5:$V24)","v":0},"Edina",{"$f":"SUMIF($T5:$U24,T2,$V5:$V24)","v":0}]
[null,null,null," Total Score",null,null,null,null,null,null," Total Score",null,null,null,null,null,null," Total Score"]
[null,null,null,"#","Swimmer","School","Total","SCORE","PLACE",null,"#","Swimmer","School","Total","SCORE","PLACE",null,"#","Swimmer","School","Total","SCORE","PLACE"]
[null,null,null,10,"Paige Anderson","Forest Lake",52.885964912280706,{"$f":"IF(ISNA(VLOOKUP(I5,Totals!$AX$3:$AY$102,2,FALSE)),\"\",VLOOKUP(I5,Totals!$AX$3:$AY$102,2,FALSE))","v":8},{"$f":"IF(ISNA(RANK(G5,G$5:G$150)),\"\",RANK(G5,G$5:G$150))","v":1},null,10,"Paige Anderson","Forest Lake",52.885964912280706,{"$f":"IF(ISNA(VLOOKUP(P5,Totals!$AX$3:$AY$102,2,FALSE)),\"\",VLOOKUP(P5,Totals!$AX$3:$AY$102,2,FALSE))","v":8},{"$f":"IF(ISNA(RANK(N5,N$5:N$150)),\"\",RANK(N5,N$5:N$150))","v":1},null,10,"Paige Anderson","Forest Lake",52.885964912280706,{"$f":"IF(ISNA(VLOOKUP(W5,Totals!$AX$3:$AY$102,2,FALSE)),\"\",VLOOKUP(W5,Totals!$AX$3:$AY$102,2,FALSE))","v":8},{"$f":"IF(ISNA(RANK(U5,U$5:U$150)),\"\",RANK(U5,U$5:U$150))","v":1}]
[null,null,null,15,"Zoe Waldron","Osseo-Maple Grove",52.596491228070178,{"$f":"IF(ISNA(VLOOKUP(I6,Totals!$AX$3:$AY$102,2,FALSE)),\"\",VLOOKUP(I6,Totals!$AX$3:$AY$102,2,FALSE))","v":6},{"$f":"IF(G6=G5,I5,IF(ISNA(RANK(G6,G$5:G$150)),\"\",RANK(G6,G$5:G$150)))","v":2},null,15,"Zoe Waldron","Osseo-Maple Grove",52.596491228070178,{"$f":"IF(ISNA(VLOOKUP(P6,Totals!$AX$3:$AY$102,2,FALSE)),\"\",VLOOKUP(P6,Totals!$AX$3:$AY$102,2,FALSE))","v":6},{"$f":"IF(ISNA(RANK(N6,N$5:N$150)),\"\",RANK(N6,N$5:N$150))","v":2},null,15,"Zoe Waldron","Osseo-Maple Grove",52.596491228070178,{"$f":"IF(ISNA(VLOOKUP(W6,Totals!$AX$3:$AY$102,2,FALSE)),\"\",VLOOKUP(W6,Totals!$AX$3:$AY$102,2,FALSE))","v":6},{"$f":"IF(ISNA(RANK(U6,U$5:U$150)),\"\",RANK(U6,U$5:U$150))","v":2}]
[null,null,null,31,"Mckinley Leavitt","Forest Lake",52.092105263157897,{"$f":"IF(ISNA(VLOOKUP(I7,Totals!$AX$3:$AY$102,2,FALSE)),\"\",VLOOKUP(I7,Totals!$AX$3:$AY$102,2,FALSE))","v":5},{"$f":"IF(G7=G6,I6,IF(ISNA(RANK(G7,G$5:G$150)),\"\",RANK(G7,G$5:G$150)))","v":3},null,31,"Mckinley Leavitt","Forest Lake",52.092105263157897,{"$f":"IF(ISNA(VLOOKUP(P7,Totals!$AX$3:$AY$102,2,FALSE)),\"\",VLOOKUP(P7,Totals!$AX$3:$AY$102,2,FALSE))","v":5},3,null,31,"Mckinley Leavitt","Forest Lake",52.092105263157897,{"$f":"IF(ISNA(VLOOKUP(W7,Totals!$AX$3:$AY$102,2,FALSE)),\"\",VLOOKUP(W7,Totals!$AX$3:$AY$102,2,FALSE))","v":5},3]
[null,null,null,1,"Jenna Stockinger","Forest Lake",50.767543859649123,{"$f":"IF(ISNA(VLOOKUP(I8,Totals!$AX$3:$AY$102,2,FALSE)),\"\",VLOOKUP(I8,Totals!$AX$3:$AY$102,2,FALSE))","v":4},4,null,1,"Jenna Stockinger","Forest Lake",50.767543859649123,{"$f":"IF(ISNA(VLOOKUP(P8,Totals!$AX$3:$AY$102,2,FALSE)),\"\",VLOOKUP(P8,Totals!$AX$3:$AY$102,2,FALSE))","v":4},4,null,1,"Jenna Stockinger","Forest Lake",50.767543859649123,{"$f":"IF(ISNA(VLOOKUP(W8,Totals!$AX$3:$AY$102,2,FALSE)),\"\",VLOOKUP(W8,Totals!$AX$3:$AY$102,2,FALSE))","v":4},4]
[null,null,null,7,"Alexandra Trudeau","Osseo-Maple Grove",49.662280701754391,{"$f":"IF(ISNA(VLOOKUP(I9,Totals!$AX$3:$AY$102,2,FALSE)),\"\",VLOOKUP(I9,Totals!$AX$3:$AY$102,2,FALSE))","v":3},5,null,7,"Alexandra Trudeau","Osseo-Maple Grove",49.662280701754391,{"$f":"IF(ISNA(VLOOKUP(P9,Totals!$AX$3:$AY$102,2,FALSE)),\"\",VLOOKUP(P9,Totals!$AX$3:$AY$102,2,FALSE))","v":3},5,null,7,"Alexandra Trudeau","Osseo-Maple Grove",49.662280701754391,{"$f":"IF(ISNA(VLOOKUP(W9,Totals!$AX$3:$AY$102,2,FALSE)),\"\",VLOOKUP(W9,Totals!$AX$3:$AY$102,2,FALSE))","v":3},5]
[null,null,null,12,"Katherine Olsen","Osseo-Maple Grove",49.385964912280713,{"$f":"IF(ISNA(VLOOKUP(I10,Totals!$AX$3:$AY$102,2,FALSE)),\"\",VLOOKUP(I10,Totals!$AX$3:$AY$102,2,FALSE))","v":2},6,null,12,"Katherine Olsen","Osseo-Maple Grove",49.385964912280713,{"$f":"IF(ISNA(VLOOKUP(P10,Totals!$AX$3:$AY$102,2,FALSE)),\"\",VLOOKUP(P10,Totals!$AX$3:$AY$102,2,FALSE))","v":2},6,null,12,"Katherine Olsen","Osseo-Maple Grove",49.385964912280713,{"$f":"IF(ISNA(VLOOKUP(W10,Totals!$AX$3:$AY$102,2,FALSE)),\"\",VLOOKUP(W10,Totals!$AX$3:$AY$102,2,FALSE))","v":2},6]
{"$rows_left_out":140}