{"text_format":"1","workbook":"xlsx","n_sheets":10,"sheets":["Student Entry","Fig 1 Ballet Leg","Fig 2 Somersault, Back Tuck","Fig 3 Somersault, Front Pike","Fig 4 Optional","Totals","Draw","Schools","Official Draw","Meet Results"],"not_rendered":{"charts":0,"images":1,"macros":1,"external_links":0,"defined_names":5,"comments":0,"pivot_tables":1},"unopened":[],"bounds":{"document_bytes":16777216,"sheet_cells":100000,"rows_first":2000,"rows_last":500,"rows_between":2000,"halvings":0,"cell_chars":16384,"cell_head_chars":4096},"cells_cut":0,"cells_raw":0,"read":"whole","date_system":"1900"}

{"sheet":"Student Entry","index":0,"n_rows":20,"n_cols":3,"rows_kept":20,"cut":false,"hidden":false,"merged":[[0,0,0,2]]}
["Student Entry"]
["School # 1 Name:","School # 2 Name:","School # 3 Name:"]
["Stillwater","Osseo-Maple Grove"]
["Student Names:","Student Names:","Student Names:"]
["Rubie Ballantyne","Anneke DeLooze"]
["Laurel Bremer","Allison Hannan"]
["Sophie Browning","Hayley Heiss"]
["Hannah Dettmann","Katherine Hildebrandt"]
["Rachel Duerr","Emily Honnold"]
["Andrea Finholt","Rachel Knox"]
{"$rows_left_out":11}
{"sheet":"Fig 1 Ballet Leg","index":1,"n_rows":150,"n_cols":11,"rows_kept":150,"cut":false,"hidden":false,"merged":[]}
[null,"Figure #1:","101 R/L Ballet Leg, single, *right or *left"]
["#","Degree of Difficulty","judge 1","judge 2","judge 3","judge 4","judge 5","Score","Penalty"]
[{"$f":"IF(Draw!E2=0,\"\",Draw!E2)","v":1},1.6,47,48,47,null,null,{"$f":"IF(B3=\"\",\"\",IF(K3=3,(SUM(C3:G3)/(300/(6.5+(B3-1)*6.5))),IF(K3=4,(SUM(C3:G3)-MAX(C3:G3))/(300/(6.5+(B3-1)*6.5)),IF(K3=5,(SUM(C3:G3)-MAX(C3:G3)-MIN(C3:G3))/(300/(6.5+(B3-1)*6.5)),0))))","v":4.9226666666666663},null,null,{"$f":"COUNT(C3:G3)","v":3}]
[{"$f":"IF(Draw!E3=0,\"\",Draw!E3)","v":2},{"$f":"IF(A4=\"\",\"\",B$3)","v":1.6},51,44,46,null,null,4.8879999999999999,null,null,{"$f":"COUNT(C4:G4)","v":3}]
[{"$f":"IF(Draw!E4=0,\"\",Draw!E4)","v":3},1.6,46,43,45,null,null,4.6453333333333333,null,null,3]
[{"$f":"IF(Draw!E5=0,\"\",Draw!E5)","v":4},{"$f":"IF(A6=\"\",\"\",B$3)","v":1.6},48,49,50,null,null,{"$f":"IF(B6=\"\",\"\",IF(K6=3,(SUM(C6:G6)/(300/(6.5+(B6-1)*6.5))),IF(K6=4,(SUM(C6:G6)-MAX(C6:G6))/(300/(6.5+(B6-1)*6.5)),IF(K6=5,(SUM(C6:G6)-MAX(C6:G6)-MIN(C6:G6))/(300/(6.5+(B6-1)*6.5)),0))))","v":5.0960000000000001},null,null,3]
[{"$f":"IF(Draw!E6=0,\"\",Draw!E6)","v":5},1.6,52,52,52,null,null,5.4079999999999995,null,null,3]
[{"$f":"IF(Draw!E7=0,\"\",Draw!E7)","v":6},1.6,53,54,56,null,null,5.6506666666666669,null,null,3]
[{"$f":"IF(Draw!E8=0,\"\",Draw!E8)","v":7},1.6,52,51,50,null,null,5.3040000000000003,null,null,3]
[{"$f":"IF(Draw!E9=0,\"\",Draw!E9)","v":8},1.6,51,50,54,null,null,5.3733333333333331,null,null,3]
{"$rows_left_out":141}
{"sheet":"Fig 2 Somersault, Back Tuck","index":2,"n_rows":150,"n_cols":11,"rows_kept":150,"cut":false,"hidden":false,"merged":[[0,2,0,6]]}
[null,"Figure #2:","301 Summersault, Back Tuck"]
["#","Degree of Difficulty","judge 1","judge 2","judge 3","judge 4","judge 5","Score","Penalty"]
[{"$f":"IF(Draw!E2=0,\"\",Draw!E2)","v":1},1.1000000000000001,47,46,46,41,45,{"$f":"IF(B3=\"\",\"\",IF(K3=3,(SUM(C3:G3)/(300/(6.5+(B3-1)*6.5))),IF(K3=4,(SUM(C3:G3)-MAX(C3:G3))/(300/(6.5+(B3-1)*6.5)),IF(K3=5,(SUM(C3:G3)-MAX(C3:G3)-MIN(C3:G3))/(300/(6.5+(B3-1)*6.5)),0))))","v":3.265166666666667},null,null,{"$f":"COUNT(C3:G3)","v":5}]
[{"$f":"IF(Draw!E3=0,\"\",Draw!E3)","v":2},{"$f":"IF(A4=\"\",\"\",B$3)","v":1.1000000000000001},51,51,50,44,51,3.6226666666666669,null,null,{"$f":"COUNT(C4:G4)","v":5}]
[{"$f":"IF(Draw!E4=0,\"\",Draw!E4)","v":3},1.1000000000000001,52,52,50,50,49,3.6226666666666669,null,null,5]
[{"$f":"IF(Draw!E5=0,\"\",Draw!E5)","v":4},{"$f":"IF(A6=\"\",\"\",B$3)","v":1.1000000000000001},53,53,52,54,53,{"$f":"IF(B6=\"\",\"\",IF(K6=3,(SUM(C6:G6)/(300/(6.5+(B6-1)*6.5))),IF(K6=4,(SUM(C6:G6)-MAX(C6:G6))/(300/(6.5+(B6-1)*6.5)),IF(K6=5,(SUM(C6:G6)-MAX(C6:G6)-MIN(C6:G6))/(300/(6.5+(B6-1)*6.5)),0))))","v":3.7895000000000003},null,null,5]
[{"$f":"IF(Draw!E6=0,\"\",Draw!E6)","v":5},1.1000000000000001,53,54,52,52,57,3.7895000000000003,null,null,5]
[{"$f":"IF(Draw!E7=0,\"\",Draw!E7)","v":6},1.1000000000000001,55,56,54,53,50,3.8610000000000007,null,null,5]
[{"$f":"IF(Draw!E8=0,\"\",Draw!E8)","v":7},1.1000000000000001,54,51,51,54,49,3.7180000000000004,null,null,5]
[{"$f":"IF(Draw!E9=0,\"\",Draw!E9)","v":8},1.1000000000000001,52,55,54,53,50,3.7895000000000003,null,null,5]
{"$rows_left_out":141}
{"sheet":"Fig 3 Somersault, Front Pike","index":3,"n_rows":150,"n_cols":11,"rows_kept":150,"cut":false,"hidden":false,"merged":[[0,2,0,6]]}
[null,"Figure #3:","320 Somersault, Front Pike"]
["#","Degree of Difficulty","judge 1","judge 2","judge 3","judge 4","judge 5","Score","Penalty"]
[{"$f":"IF(Draw!E2=0,\"\",Draw!E2)","v":1},1.7,50,49,48,52,49,{"$f":"IF(B3=\"\",\"\",IF(K3=3,(SUM(C3:G3)/(300/(6.5+(B3-1)*6.5))),IF(K3=4,(SUM(C3:G3)-MAX(C3:G3))/(300/(6.5+(B3-1)*6.5)),IF(K3=5,(SUM(C3:G3)-MAX(C3:G3)-MIN(C3:G3))/(300/(6.5+(B3-1)*6.5)),0))))","v":5.4513333333333334},null,null,{"$f":"COUNT(C3:G3)","v":5}]
[{"$f":"IF(Draw!E3=0,\"\",Draw!E3)","v":2},{"$f":"IF(A4=\"\",\"\",B$3)","v":1.7},52,47,48,49,47,5.3040000000000003,null,null,{"$f":"COUNT(C4:G4)","v":5}]
[{"$f":"IF(Draw!E4=0,\"\",Draw!E4)","v":3},1.7,50,50,50,52,46,5.5250000000000004,null,null,5]
[{"$f":"IF(Draw!E5=0,\"\",Draw!E5)","v":4},{"$f":"IF(A6=\"\",\"\",B$3)","v":1.7},53,53,54,53,50,{"$f":"IF(B6=\"\",\"\",IF(K6=3,(SUM(C6:G6)/(300/(6.5+(B6-1)*6.5))),IF(K6=4,(SUM(C6:G6)-MAX(C6:G6))/(300/(6.5+(B6-1)*6.5)),IF(K6=5,(SUM(C6:G6)-MAX(C6:G6)-MIN(C6:G6))/(300/(6.5+(B6-1)*6.5)),0))))","v":5.8565000000000005},null,null,5]
[{"$f":"IF(Draw!E6=0,\"\",Draw!E6)","v":5},1.7,51,56,54,55,51,5.8933333333333335,null,null,5]
[{"$f":"IF(Draw!E7=0,\"\",Draw!E7)","v":6},1.7,59,59,59,60,58,6.5194999999999999,null,"Discrepancy on judge 2: 59, 59, 49",5]
[{"$f":"IF(Draw!E8=0,\"\",Draw!E8)","v":7},1.7,53,53,54,49,52,5.8196666666666665,null,null,5]
[{"$f":"IF(Draw!E9=0,\"\",Draw!E9)","v":8},1.7,51,50,55,50,50,5.5618333333333334,null,null,5]
{"$rows_left_out":141}
{"sheet":"Fig 4 Optional","index":4,"n_rows":150,"n_cols":11,"rows_kept":150,"cut":false,"hidden":false,"merged":[[0,2,0,6]]}
[null,"Figure #4:","Optional"]
["#","Degree of Difficulty","judge 1","judge 2","judge 3","judge 4","judge 5","Score","Penalties"]
[{"$f":"IF(Draw!E2=0,\"\",Draw!E2)","v":1},2.1,44,43,44,null,null,{"$f":"IF(B3=\"\",\"\",IF(K3=3,(SUM(C3:G3)/(300/(6.5+(B3-1)*6.5))),IF(K3=4,(SUM(C3:G3)-MAX(C3:G3))/(300/(6.5+(B3-1)*6.5)),IF(K3=5,(SUM(C3:G3)-MAX(C3:G3)-MIN(C3:G3))/(300/(6.5+(B3-1)*6.5)),0))))","v":5.9604999999999997},null,null,{"$f":"COUNT(C3:G3)","v":3}]
[{"$f":"IF(Draw!E3=0,\"\",Draw!E3)","v":2},{"$f":"IF(A4=\"\",\"\",B$3)","v":2.1},47,47,47,null,null,6.4154999999999998,null,null,{"$f":"COUNT(C4:G4)","v":3}]
[{"$f":"IF(Draw!E4=0,\"\",Draw!E4)","v":3},1.2,55,58,54,null,null,4.3420000000000005,null,null,3]
[{"$f":"IF(Draw!E5=0,\"\",Draw!E5)","v":4},{"$f":"IF(A6=\"\",\"\",B$3)","v":2.1},48,49,49,null,null,{"$f":"IF(B6=\"\",\"\",IF(K6=3,(SUM(C6:G6)/(300/(6.5+(B6-1)*6.5))),IF(K6=4,(SUM(C6:G6)-MAX(C6:G6))/(300/(6.5+(B6-1)*6.5)),IF(K6=5,(SUM(C6:G6)-MAX(C6:G6)-MIN(C6:G6))/(300/(6.5+(B6-1)*6.5)),0))))","v":6.6429999999999998},null,null,3]
[{"$f":"IF(Draw!E6=0,\"\",Draw!E6)","v":5},2.1,48,52,48,null,null,6.734,null,null,3]
[{"$f":"IF(Draw!E7=0,\"\",Draw!E7)","v":6},2.1,54,56,57,null,null,7.5984999999999996,null,null,3]
[{"$f":"IF(Draw!E8=0,\"\",Draw!E8)","v":7},2.1,49,48,46,null,null,6.5065,null,null,3]
[{"$f":"IF(Draw!E9=0,\"\",Draw!E9)","v":8},2.1,43,41,42,null,null,5.7329999999999997,null,null,3]
{"$rows_left_out":141}
{"sheet":"Totals","index":5,"n_rows":185,"n_cols":51,"rows_kept":185,"cut":false,"hidden":false,"merged":[]}
["#","Swimmer","School","Total Score","Place","Figure 1","Figure 2","Figure 3","Figure 4","Penalties","Score"]
[{"$f":"IF(Draw!E2=0,\"\",Draw!E2)","v":1},"Emily Honnold","Osseo-Maple Grove",{"$f":"IF($A2=\"\",\"\",SUM(F2:I2)-J2)","v":19.599666666666668},{"$f":"IF($A2=\"\",\"\",RANK(D2,D$2:D$200))","v":22},{"$f":"IF($A2=\"\",\"\",'Fig 1 Ballet Leg'!H3)","v":4.9226666666666663},{"$f":"IF($A2=\"\",\"\",'Fig 2 Somersault, Back Tuck'!H3)","v":3.265166666666667},{"$f":"IF($A2=\"\",\"\",'Fig 3 Somersault, Front Pike'!H3)","v":5.4513333333333334},{"$f":"IF($A2=\"\",\"\",'Fig 4 Optional'!H3)","v":5.9604999999999997},{"$f":"IF($A2=\"\",\"\",'Fig 1 Ballet Leg'!I3+'Fig 2 Somersault, Back Tuck'!I3+'Fig 3 Somersault, Front Pike'!I3+'Fig 4 Optional'!I3)","v":0},{"$f":"IF($A2=\"\",\"\",IF(A2=\"\",\"\",VLOOKUP(E2,AX$3:AY$102,2,FALSE)))","v":0}]
[{"$f":"IF(Draw!E3=0,\"\",Draw!E3)","v":2},"Kya Hodgdon","Stillwater",{"$f":"IF($A3=\"\",\"\",SUM(F3:I3)-J3)","v":20.230166666666669},{"$f":"IF($A3=\"\",\"\",RANK(D3,D$2:D$200))","v":21},{"$f":"IF($A3=\"\",\"\",'Fig 1 Ballet Leg'!H4)","v":4.8879999999999999},{"$f":"IF($A3=\"\",\"\",'Fig 2 Somersault, Back Tuck'!H4)","v":3.6226666666666669},{"$f":"IF($A3=\"\",\"\",'Fig 3 Somersault, Front Pike'!H4)","v":5.3040000000000003},{"$f":"IF($A3=\"\",\"\",'Fig 4 Optional'!H4)","v":6.4154999999999998},{"$f":"IF($A3=\"\",\"\",'Fig 1 Ballet Leg'!I4+'Fig 2 Somersault, Back Tuck'!I4+'Fig 3 Somersault, Front Pike'!I4+'Fig 4 Optional'!I4)","v":0},{"$f":"IF($A3=\"\",\"\",IF(A3=\"\",\"\",VLOOKUP(E3,AX$3:AY$102,2,FALSE)))","v":0},null,null,null,null,null,null,null,null,null,null,null,null,null,null,null,null,null,null,null,null,null,null,null,null,null,null,null,null,null,null,null,null,null,null,null,null,null,null,1,8]
[{"$f":"IF(Draw!E4=0,\"\",Draw!E4)","v":3},"Khuluc Yang","Stillwater",18.135000000000002,24,{"$f":"IF($A4=\"\",\"\",'Fig 1 Ballet Leg'!H5)","v":4.6453333333333333},{"$f":"IF($A4=\"\",\"\",'Fig 2 Somersault, Back Tuck'!H5)","v":3.6226666666666669},{"$f":"IF($A4=\"\",\"\",'Fig 3 Somersault, Front Pike'!H5)","v":5.5250000000000004},{"$f":"IF($A4=\"\",\"\",'Fig 4 Optional'!H5)","v":4.3420000000000005},{"$f":"IF($A4=\"\",\"\",'Fig 1 Ballet Leg'!I5+'Fig 2 Somersault, Back Tuck'!I5+'Fig 3 Somersault, Front Pike'!I5+'Fig 4 Optional'!I5)","v":0},0,null,null,null,null,null,null,null,null,null,null,null,null,null,null,null,null,null,null,null,null,null,null,null,null,null,null,null,null,null,null,null,null,null,null,null,null,null,null,2,6]
[{"$f":"IF(Draw!E5=0,\"\",Draw!E5)","v":4},"Bree Sheridan","Stillwater",{"$f":"IF($A5=\"\",\"\",SUM(F5:I5)-J5)","v":21.385000000000002},{"$f":"IF($A5=\"\",\"\",RANK(D5,D$2:D$200))","v":13},{"$f":"IF($A5=\"\",\"\",'Fig 1 Ballet Leg'!H6)","v":5.0960000000000001},{"$f":"IF($A5=\"\",\"\",'Fig 2 Somersault, Back Tuck'!H6)","v":3.7895000000000003},{"$f":"IF($A5=\"\",\"\",'Fig 3 Somersault, Front Pike'!H6)","v":5.8565000000000005},{"$f":"IF($A5=\"\",\"\",'Fig 4 Optional'!H6)","v":6.6429999999999998},{"$f":"IF($A5=\"\",\"\",'Fig 1 Ballet Leg'!I6+'Fig 2 Somersault, Back Tuck'!I6+'Fig 3 Somersault, Front Pike'!I6+'Fig 4 Optional'!I6)","v":0},{"$f":"IF($A5=\"\",\"\",IF(A5=\"\",\"\",VLOOKUP(E5,AX$3:AY$102,2,FALSE)))","v":0},null,null,null,null,null,null,null,null,null,null,null,null,null,null,null,null,null,null,null,null,null,null,null,null,null,null,null,null,null,null,null,null,null,null,null,null,null,null,3,5]
[{"$f":"IF(Draw!E6=0,\"\",Draw!E6)","v":5},"Hayley Heiss","Osseo-Maple Grove",21.824833333333331,10,{"$f":"IF($A6=\"\",\"\",'Fig 1 Ballet Leg'!H7)","v":5.4079999999999995},{"$f":"IF($A6=\"\",\"\",'Fig 2 Somersault, Back Tuck'!H7)","v":3.7895000000000003},{"$f":"IF($A6=\"\",\"\",'Fig 3 Somersault, Front Pike'!H7)","v":5.8933333333333335},{"$f":"IF($A6=\"\",\"\",'Fig 4 Optional'!H7)","v":6.734},{"$f":"IF($A6=\"\",\"\",'Fig 1 Ballet Leg'!I7+'Fig 2 Somersault, Back Tuck'!I7+'Fig 3 Somersault, Front Pike'!I7+'Fig 4 Optional'!I7)","v":0},0,null,null,null,null,null,null,null,null,null,null,null,null,null,null,null,null,null,null,null,null,null,null,null,null,null,null,null,null,null,null,null,null,null,null,null,null,null,null,4,4]
[{"$f":"IF(Draw!E7=0,\"\",Draw!E7)","v":6},"Morgan Tope-Yates","Stillwater",23.629666666666665,1,{"$f":"IF($A7=\"\",\"\",'Fig 1 Ballet Leg'!H8)","v":5.6506666666666669},{"$f":"IF($A7=\"\",\"\",'Fig 2 Somersault, Back Tuck'!H8)","v":3.8610000000000007},{"$f":"IF($A7=\"\",\"\",'Fig 3 Somersault, Front Pike'!H8)","v":6.5194999999999999},{"$f":"IF($A7=\"\",\"\",'Fig 4 Optional'!H8)","v":7.5984999999999996},{"$f":"IF($A7=\"\",\"\",'Fig 1 Ballet Leg'!I8+'Fig 2 Somersault, Back Tuck'!I8+'Fig 3 Somersault, Front Pike'!I8+'Fig 4 Optional'!I8)","v":0},8,null,null,null,null,null,null,null,null,null,null,null,null,null,null,null,null,null,null,null,null,null,null,null,null,null,null,null,null,null,null,null,null,null,null,null,null,null,null,5,3]
[{"$f":"IF(Draw!E8=0,\"\",Draw!E8)","v":7},"Margo Prentice","Osseo-Maple Grove",21.348166666666668,14,{"$f":"IF($A8=\"\",\"\",'Fig 1 Ballet Leg'!H9)","v":5.3040000000000003},{"$f":"IF($A8=\"\",\"\",'Fig 2 Somersault, Back Tuck'!H9)","v":3.7180000000000004},{"$f":"IF($A8=\"\",\"\",'Fig 3 Somersault, Front Pike'!H9)","v":5.8196666666666665},{"$f":"IF($A8=\"\",\"\",'Fig 4 Optional'!H9)","v":6.5065},{"$f":"IF($A8=\"\",\"\",'Fig 1 Ballet Leg'!I9+'Fig 2 Somersault, Back Tuck'!I9+'Fig 3 Somersault, Front Pike'!I9+'Fig 4 Optional'!I9)","v":0},0,null,null,null,null,null,null,null,null,null,null,null,null,null,null,null,null,null,null,null,null,null,null,null,null,null,null,null,null,null,null,null,null,null,null,null,null,null,null,6,2]
[{"$f":"IF(Draw!E9=0,\"\",Draw!E9)","v":8},"Emily Shanley","Stillwater",20.457666666666668,20,{"$f":"IF($A9=\"\",\"\",'Fig 1 Ballet Leg'!H10)","v":5.3733333333333331},{"$f":"IF($A9=\"\",\"\",'Fig 2 Somersault, Back Tuck'!H10)","v":3.7895000000000003},{"$f":"IF($A9=\"\",\"\",'Fig 3 Somersault, Front Pike'!H10)","v":5.5618333333333334},{"$f":"IF($A9=\"\",\"\",'Fig 4 Optional'!H10)","v":5.7329999999999997},{"$f":"IF($A9=\"\",\"\",'Fig 1 Ballet Leg'!I10+'Fig 2 Somersault, Back Tuck'!I10+'Fig 3 Somersault, Front Pike'!I10+'Fig 4 Optional'!I10)","v":0},0,null,null,null,null,null,null,null,null,null,null,null,null,null,null,null,null,null,null,null,null,null,null,null,null,null,null,null,null,null,null,null,null,null,null,null,null,null,null,7,1]
[{"$f":"IF(Draw!E10=0,\"\",Draw!E10)","v":9},"Zoe Waldron","Osseo-Maple Grove",22.955833333333334,5,{"$f":"IF($A10=\"\",\"\",'Fig 1 Ballet Leg'!H11)","v":5.6853333333333333},{"$f":"IF($A10=\"\",\"\",'Fig 2 Somersault, Back Tuck'!H11)","v":3.8371666666666671},{"$f":"IF($A10=\"\",\"\",'Fig 3 Somersault, Front Pike'!H11)","v":6.3353333333333337},{"$f":"IF($A10=\"\",\"\",'Fig 4 Optional'!H11)","v":7.0979999999999999},{"$f":"IF($A10=\"\",\"\",'Fig 1 Ballet Leg'!I11+'Fig 2 Somersault, Back Tuck'!I11+'Fig 3 Somersault, Front Pike'!I11+'Fig 4 Optional'!I11)","v":0},3,null,null,null,null,null,null,null,null,null,null,null,null,null,null,null,null,null,null,null,null,null,null,null,null,null,null,null,null,null,null,null,null,null,null,null,null,null,null,8,0]
{"$rows_left_out":176}
{"sheet":"Draw","index":6,"n_rows":150,"n_cols":16,"rows_kept":150,"cut":false,"hidden":true,"merged":[]}
[1,"S4","Stillwater",null,null,null,"School","Name","Draw #","Name","School"]
["Emily Honnold","Osseo-Maple Grove",{"$f":"RAND()","v":0.55501277604449628},{"$f":"IF(ISNA(RANK(C2,C$2:C$150,1)),\"\",RANK(C2,C$2:C$150,1))","v":15},{"$f":"IF(B2<>\"\",F2,\"\")","v":1},1,{"$f":"B2","v":"Osseo-Maple Grove"},{"$f":"A2","v":"Emily Honnold"},{"$f":"E2","v":1},{"$f":"IF(ISNA(VLOOKUP(I2,D$2:H$150,5,FALSE)),\"\",VLOOKUP(I2,D$2:H$150,5,FALSE))","v":"Emily Shanley"},{"$f":"IF(ISNA(VLOOKUP(I2,D$2:G$150,4,FALSE)),\"\",VLOOKUP(I2,D$2:G$150,4,FALSE))","v":"Stillwater"},null,null,1,"Emily Honnold","Osseo-Maple Grove"]
["Kya Hodgdon","Stillwater",0.74469406712339847,{"$f":"IF(ISNA(RANK(C3,C$2:C$150,1)),\"\",RANK(C3,C$2:C$150,1))","v":21},{"$f":"IF(B3<>\"\",F3,\"\")","v":2},2,{"$f":"B3","v":"Stillwater"},{"$f":"A3","v":"Kya Hodgdon"},{"$f":"E3","v":2},{"$f":"IF(ISNA(VLOOKUP(I3,D$2:H$150,5,FALSE)),\"\",VLOOKUP(I3,D$2:H$150,5,FALSE))","v":"Bree Sheridan"},{"$f":"IF(ISNA(VLOOKUP(I3,D$2:G$150,4,FALSE)),\"\",VLOOKUP(I3,D$2:G$150,4,FALSE))","v":"Stillwater"},null,null,2,"Kya Hodgdon","Stillwater"]
["Khuluc Yang","Stillwater",0.74757766341855658,22,3,3,"Stillwater","Khuluc Yang",3,"Rachel Duerr","Stillwater",null,null,3,"Khuluc Yang","Stillwater"]
["Bree Sheridan","Stillwater",0.10538641308019736,2,4,4,"Stillwater","Bree Sheridan",4,"Katherine Hildebrandt","Osseo-Maple Grove",null,null,4,"Bree Sheridan","Stillwater"]
["Hayley Heiss","Osseo-Maple Grove",0.89745032817414527,24,5,5,"Osseo-Maple Grove","Hayley Heiss",5,"Emma Sneden","Stillwater",null,null,5,"Hayley Heiss","Osseo-Maple Grove"]
["Morgan Tope-Yates","Stillwater",0.29738884968768919,7,6,6,"Stillwater","Morgan Tope-Yates",6,"Rubie Ballantyne","Stillwater",null,null,6,"Morgan Tope-Yates","Stillwater"]
["Margo Prentice","Osseo-Maple Grove",0.53636471512679407,13,7,7,"Osseo-Maple Grove","Margo Prentice",7,"Morgan Tope-Yates","Stillwater",null,null,7,"Margo Prentice","Osseo-Maple Grove"]
["Emily Shanley","Stillwater",7.6676331061537151E-2,1,8,8,"Stillwater","Emily Shanley",8,"Andrea Finholt","Stillwater",null,null,8,"Emily Shanley","Stillwater"]
["Zoe Waldron","Osseo-Maple Grove",0.80331033116252537,23,9,9,"Osseo-Maple Grove","Zoe Waldron",9,"Laurel Bremer","Stillwater",null,null,9,"Zoe Waldron","Osseo-Maple Grove"]
{"$rows_left_out":141}
{"sheet":"Schools","index":7,"n_rows":15,"n_cols":1,"rows_kept":15,"cut":false,"hidden":true,"merged":[]}
["List of Schools:"]
["Blake"]
["Bloomington"]
["Columbia Heights"]
["Eden Prairie"]
["Edina"]
["Forest Lake"]
["Hopkins"]
["Itasca"]
["Osseo-Maple Grove"]
{"$rows_left_out":6}
{"sheet":"Official Draw","index":8,"n_rows":151,"n_cols":4,"rows_kept":151,"cut":false,"hidden":false,"merged":[]}
[]
[null,{"$f":"Draw!I1","v":"Draw #"},{"$f":"Draw!J1","v":"Name"},{"$f":"Draw!K1","v":"School"}]
[null,1,"Emily Honnold","Osseo-Maple Grove"]
[null,2,"Kya Hodgdon","Stillwater"]
[null,3,"Khuluc Yang","Stillwater"]
[null,4,"Bree Sheridan","Stillwater"]
[null,5,"Hayley Heiss","Osseo-Maple Grove"]
[null,6,"Morgan Tope-Yates","Stillwater"]
[null,7,"Margo Prentice","Osseo-Maple Grove"]
[null,8,"Emily Shanley","Stillwater"]
{"$rows_left_out":142}
{"sheet":"Meet Results","index":9,"n_rows":150,"n_cols":9,"rows_kept":150,"cut":false,"hidden":false,"merged":[]}
[]
[null,null,null,"Stillwater",{"$f":"SUMIF($F5:$H150,D2,$H5:$H150)","v":26},"Osseo-Maple Grove",{"$f":"SUMIF($F5:$H150,F2,$H5:$H150)","v":3}]
[null,null,null," Total Score"]
[null,null,null,"#","Swimmer","School","Total","SCORE","PLACE"]
[null,null,null,6,"Morgan Tope-Yates","Stillwater",23.629666666666665,{"$f":"IF(ISNA(VLOOKUP(I5,Totals!$AX$3:$AY$102,2,FALSE)),\"\",VLOOKUP(I5,Totals!$AX$3:$AY$102,2,FALSE))","v":8},{"$f":"IF(ISNA(RANK(G5,G$5:G$150)),\"\",RANK(G5,G$5:G$150))","v":1}]
[null,null,null,24,"Rubie Ballantyne","Stillwater",23.590666666666671,{"$f":"IF(ISNA(VLOOKUP(I6,Totals!$AX$3:$AY$102,2,FALSE)),\"\",VLOOKUP(I6,Totals!$AX$3:$AY$102,2,FALSE))","v":6},{"$f":"IF(G6=G5,I5,IF(ISNA(RANK(G6,G$5:G$150)),\"\",RANK(G6,G$5:G$150)))","v":2}]
[null,null,null,12,"Hannah Dettmann","Stillwater",23.1465,{"$f":"IF(ISNA(VLOOKUP(I7,Totals!$AX$3:$AY$102,2,FALSE)),\"\",VLOOKUP(I7,Totals!$AX$3:$AY$102,2,FALSE))","v":5},{"$f":"IF(G7=G6,I6,IF(ISNA(RANK(G7,G$5:G$150)),\"\",RANK(G7,G$5:G$150)))","v":3}]
[null,null,null,11,"Carolyn Wrightsman","Stillwater",23.077166666666667,{"$f":"IF(ISNA(VLOOKUP(I8,Totals!$AX$3:$AY$102,2,FALSE)),\"\",VLOOKUP(I8,Totals!$AX$3:$AY$102,2,FALSE))","v":4},4]
[null,null,null,9,"Zoe Waldron","Osseo-Maple Grove",22.955833333333334,{"$f":"IF(ISNA(VLOOKUP(I9,Totals!$AX$3:$AY$102,2,FALSE)),\"\",VLOOKUP(I9,Totals!$AX$3:$AY$102,2,FALSE))","v":3},5]
[null,null,null,19,"Emma Sneden","Stillwater",22.953666666666667,{"$f":"IF(ISNA(VLOOKUP(I10,Totals!$AX$3:$AY$102,2,FALSE)),\"\",VLOOKUP(I10,Totals!$AX$3:$AY$102,2,FALSE))","v":2},6]
{"$rows_left_out":140}