{"text_format":"1","workbook":"xlsx","n_sheets":10,"sheets":["Student Entry","Fig 1 Ballet Leg","Fig 2 Barracuda","Fig 3 Neptunus","Fig 4 Walkover","Totals","Draw","Schools","Official Draw","Meet Results"],"not_rendered":{"charts":0,"images":1,"macros":1,"external_links":1,"defined_names":4,"comments":0,"pivot_tables":3},"unopened":[],"bounds":{"document_bytes":16777216,"sheet_cells":100000,"rows_first":2000,"rows_last":500,"rows_between":2000,"halvings":0,"cell_chars":16384,"cell_head_chars":4096},"cells_cut":0,"cells_raw":0,"read":"whole","date_system":"1900"}

{"sheet":"Student Entry","index":0,"n_rows":42,"n_cols":3,"rows_kept":42,"cut":false,"hidden":false,"merged":[[0,0,0,2]]}
["Student Entry"]
["School # 1 Name:","School # 2 Name:","School # 3 Name:"]
["Osseo-Maple Grove","Forest Lake"]
["Student Names:","Student Names:","Student Names:"]
["Emily Barr","Ella Anderson"]
["Heather Breidenbach","Malissa Ball"]
["Holly Drazenovich","Jane Burk"]
["Anna Ganser","Annie Larson"]
["Danielle Hawes","Cora Martinez"]
["Elisabeth Heitzig","Bridget Olson"]
{"$rows_left_out":33}
{"sheet":"Fig 1 Ballet Leg","index":1,"n_rows":150,"n_cols":11,"rows_kept":150,"cut":false,"hidden":false,"merged":[]}
[null,"Figure #1:","101 R/L Ballet Leg, single, *right or *left"]
["#","Degree of Difficulty","Judge 1","Judge 2","Judge 3","Judge 4","Judge 5","Score","Penalty"]
[{"$f":"IF([1]Draw!E2=0,\"\",[1]Draw!E2)","v":1},1.6,57,56,54,null,null,{"$f":"IF(B3=\"\",\"\",IF(K3=5,(SUM(C3:G3)-MAX(C3:G3)-MIN(C3:G3))/3,IF(K3=4,(SUM(C3:G3)-MAX(C3:G3))/3,SUM(C3:G3)/3))*B3/7.6)","v":11.719298245614036},null,null,{"$f":"COUNT(C3:G3)","v":3}]
[{"$f":"IF([1]Draw!E3=0,\"\",[1]Draw!E3)","v":2},{"$f":"IF(A4=\"\",\"\",B$3)","v":1.6},57,58,53,null,null,{"$f":"IF(B4=\"\",\"\",IF(K4=5,(SUM(C4:G4)-MAX(C4:G4)-MIN(C4:G4))/3,IF(K4=4,(SUM(C4:G4)-MAX(C4:G4))/3,SUM(C4:G4)/3))*B4/7.6)","v":11.789473684210527},null,null,{"$f":"COUNT(C4:G4)","v":3}]
[{"$f":"IF([1]Draw!E4=0,\"\",[1]Draw!E4)","v":3},1.6,54,52,53,null,null,11.157894736842108,null,null,3]
[4,{"$f":"IF(A6=\"\",\"\",B$3)","v":1.6},55,55,58,null,null,{"$f":"IF(B6=\"\",\"\",IF(K6=5,(SUM(C6:G6)-MAX(C6:G6)-MIN(C6:G6))/3,IF(K6=4,(SUM(C6:G6)-MAX(C6:G6))/3,SUM(C6:G6)/3))*B6/7.6)","v":11.789473684210527},null,null,3]
[5,1.6,58,59,55,null,null,12.070175438596493,null,null,3]
[6,{"$f":"IF(A8=\"\",\"\",B$3)","v":1.6},53,57,55,null,null,{"$f":"IF(B8=\"\",\"\",IF(K8=5,(SUM(C8:G8)-MAX(C8:G8)-MIN(C8:G8))/3,IF(K8=4,(SUM(C8:G8)-MAX(C8:G8))/3,SUM(C8:G8)/3))*B8/7.6)","v":11.578947368421053},null,null,3]
[7,1.6,54,54,52,null,null,11.228070175438598,null,null,3]
[8,{"$f":"IF(A10=\"\",\"\",B$3)","v":1.6},56,55,55,null,null,{"$f":"IF(B10=\"\",\"\",IF(K10=5,(SUM(C10:G10)-MAX(C10:G10)-MIN(C10:G10))/3,IF(K10=4,(SUM(C10:G10)-MAX(C10:G10))/3,SUM(C10:G10)/3))*B10/7.6)","v":11.649122807017546},null,null,3]
{"$rows_left_out":141}
{"sheet":"Fig 2 Barracuda","index":2,"n_rows":150,"n_cols":11,"rows_kept":150,"cut":false,"hidden":false,"merged":[[0,2,0,6]]}
[null,"Figure #2:"," 301 Barracuda"]
["#","Degree of Difficulty","Judge 1","Judge 2","Judge 3","Judge 4","Judge 5","Score","Penalty"]
[1,2,60,61,60,null,null,{"$f":"IF(B3=\"\",\"\",IF(K3=5,(SUM(C3:G3)-MAX(C3:G3)-MIN(C3:G3))/3,IF(K3=4,(SUM(C3:G3)-MAX(C3:G3))/3,SUM(C3:G3)/3))*B3/7.6)","v":15.877192982456142},null,null,{"$f":"COUNT(C3:G3)","v":3}]
[2,{"$f":"IF(A4=\"\",\"\",B$3)","v":2},50,57,55,null,null,{"$f":"IF(B4=\"\",\"\",IF(K4=5,(SUM(C4:G4)-MAX(C4:G4)-MIN(C4:G4))/3,IF(K4=4,(SUM(C4:G4)-MAX(C4:G4))/3,SUM(C4:G4)/3))*B4/7.6)","v":14.210526315789474},null,null,{"$f":"COUNT(C4:G4)","v":3}]
[3,2,61,58,62,null,null,15.877192982456142,null,null,3]
[4,{"$f":"IF(A6=\"\",\"\",B$3)","v":2},57,60,54,null,null,{"$f":"IF(B6=\"\",\"\",IF(K6=5,(SUM(C6:G6)-MAX(C6:G6)-MIN(C6:G6))/3,IF(K6=4,(SUM(C6:G6)-MAX(C6:G6))/3,SUM(C6:G6)/3))*B6/7.6)","v":15},null,null,3]
[5,2,55,56,56,null,null,14.649122807017545,null,null,3]
[6,{"$f":"IF(A8=\"\",\"\",B$3)","v":2},53,54,54,null,null,{"$f":"IF(B8=\"\",\"\",IF(K8=5,(SUM(C8:G8)-MAX(C8:G8)-MIN(C8:G8))/3,IF(K8=4,(SUM(C8:G8)-MAX(C8:G8))/3,SUM(C8:G8)/3))*B8/7.6)","v":14.12280701754386},null,null,3]
[7,2,50,53,53,null,null,13.684210526315789,null,null,3]
[8,{"$f":"IF(A10=\"\",\"\",B$3)","v":2},56,55,55,null,null,{"$f":"IF(B10=\"\",\"\",IF(K10=5,(SUM(C10:G10)-MAX(C10:G10)-MIN(C10:G10))/3,IF(K10=4,(SUM(C10:G10)-MAX(C10:G10))/3,SUM(C10:G10)/3))*B10/7.6)","v":14.561403508771932},null,null,3]
{"$rows_left_out":141}
{"sheet":"Fig 3 Neptunus","index":3,"n_rows":150,"n_cols":11,"rows_kept":150,"cut":false,"hidden":false,"merged":[[0,2,0,6]]}
[null,"Figure #3:","344 Neptunus"]
["#","Degree of Difficulty","Judge 1","Judge 2","Judge 3","Judge 4","Judge 5","Score","Penalty"]
[1,1.8,57,52,54,55,53,{"$f":"IF(B3=\"\",\"\",IF(K3=5,(SUM(C3:G3)-MAX(C3:G3)-MIN(C3:G3))/3,IF(K3=4,(SUM(C3:G3)-MAX(C3:G3))/3,SUM(C3:G3)/3))*B3/7.6)","v":12.789473684210527},null,null,{"$f":"COUNT(C3:G3)","v":5}]
[2,{"$f":"IF(A3=\"\",\"\",B$3)","v":1.8},54,54,54,52,51,{"$f":"IF(B4=\"\",\"\",IF(K4=5,(SUM(C4:G4)-MAX(C4:G4)-MIN(C4:G4))/3,IF(K4=4,(SUM(C4:G4)-MAX(C4:G4))/3,SUM(C4:G4)/3))*B4/7.6)","v":12.631578947368421},null,null,{"$f":"COUNT(C4:G4)","v":5}]
[3,1.8,56,53,52,55,52,12.631578947368421,null,null,5]
[4,{"$f":"IF(A5=\"\",\"\",B$3)","v":1.8},56,57,56,56,56,{"$f":"IF(B6=\"\",\"\",IF(K6=5,(SUM(C6:G6)-MAX(C6:G6)-MIN(C6:G6))/3,IF(K6=4,(SUM(C6:G6)-MAX(C6:G6))/3,SUM(C6:G6)/3))*B6/7.6)","v":13.263157894736842},null,null,5]
[5,1.8,60,58,60,63,60,14.210526315789474,null,null,5]
[6,{"$f":"IF(A7=\"\",\"\",B$3)","v":1.8},60,54,56,56,56,{"$f":"IF(B8=\"\",\"\",IF(K8=5,(SUM(C8:G8)-MAX(C8:G8)-MIN(C8:G8))/3,IF(K8=4,(SUM(C8:G8)-MAX(C8:G8))/3,SUM(C8:G8)/3))*B8/7.6)","v":13.263157894736842},null,null,5]
[7,1.8,56,58,60,58,57,13.657894736842106,null,null,5]
[8,{"$f":"IF(A9=\"\",\"\",B$3)","v":1.8},58,60,59,59,59,{"$f":"IF(B10=\"\",\"\",IF(K10=5,(SUM(C10:G10)-MAX(C10:G10)-MIN(C10:G10))/3,IF(K10=4,(SUM(C10:G10)-MAX(C10:G10))/3,SUM(C10:G10)/3))*B10/7.6)","v":13.973684210526317},null,null,5]
{"$rows_left_out":141}
{"sheet":"Fig 4 Walkover","index":4,"n_rows":150,"n_cols":11,"rows_kept":150,"cut":false,"hidden":false,"merged":[[0,2,0,6]]}
[null,"Figure #4:","360 Walkover Front"]
["#","Degree of Difficulty","Judge 1","Judge 2","Judge 3","Judge 4","Judge 5","Score","Penalty"]
[{"$f":"IF([1]Draw!E2=0,\"\",[1]Draw!E2)","v":1},2.1,57,58,56,55,56,{"$f":"IF(B3=\"\",\"\",IF(K3=5,(SUM(C3:G3)-MAX(C3:G3)-MIN(C3:G3))/3,IF(K3=4,(SUM(C3:G3)-MAX(C3:G3))/3,SUM(C3:G3)/3))*B3/7.6)","v":15.565789473684212},null,null,{"$f":"COUNT(C3:G3)","v":5}]
[{"$f":"IF([1]Draw!E3=0,\"\",[1]Draw!E3)","v":2},{"$f":"IF(A4=\"\",\"\",B$3)","v":2.1},59,57,58,56,57,{"$f":"IF(B4=\"\",\"\",IF(K4=5,(SUM(C4:G4)-MAX(C4:G4)-MIN(C4:G4))/3,IF(K4=4,(SUM(C4:G4)-MAX(C4:G4))/3,SUM(C4:G4)/3))*B4/7.6)","v":15.842105263157896},null,null,{"$f":"COUNT(C4:G4)","v":5}]
[{"$f":"IF([1]Draw!E4=0,\"\",[1]Draw!E4)","v":3},2.1,55,60,57,58,55,15.657894736842106,null,null,5]
[4,2.1,56,54,56,54,52,{"$f":"IF(B6=\"\",\"\",IF(K6=5,(SUM(C6:G6)-MAX(C6:G6)-MIN(C6:G6))/3,IF(K6=4,(SUM(C6:G6)-MAX(C6:G6))/3,SUM(C6:G6)/3))*B6/7.6)","v":15.105263157894738},null,null,5]
[5,2.1,58,58,59,59,58,16.118421052631582,null,null,5]
[6,2.1,52,55,54,54,54,{"$f":"IF(B8=\"\",\"\",IF(K8=5,(SUM(C8:G8)-MAX(C8:G8)-MIN(C8:G8))/3,IF(K8=4,(SUM(C8:G8)-MAX(C8:G8))/3,SUM(C8:G8)/3))*B8/7.6)","v":14.921052631578949},null,null,5]
[7,2.1,58,55,59,59,59,16.210526315789476,null,null,5]
[8,{"$f":"IF(A10=\"\",\"\",B$3)","v":2.1},59,59,57,58,56,{"$f":"IF(B10=\"\",\"\",IF(K10=5,(SUM(C10:G10)-MAX(C10:G10)-MIN(C10:G10))/3,IF(K10=4,(SUM(C10:G10)-MAX(C10:G10))/3,SUM(C10:G10)/3))*B10/7.6)","v":16.026315789473685},null,null,5]
{"$rows_left_out":141}
{"sheet":"Totals","index":5,"n_rows":151,"n_cols":51,"rows_kept":151,"cut":false,"hidden":false,"merged":[]}
["#","Swimmer","School","Total Score","Place","Figure 1","Figure 2","Figure 3","Figure 4","Penalties","Score"]
[{"$f":"IF(Draw!E2=0,\"\",Draw!E2)","v":1},"Anna Stockinger","Forest Lake",{"$f":"IF($A2=\"\",\"\",SUM(F2:I2)-J2)","v":55.951754385964918},{"$f":"IF($A2=\"\",\"\",RANK(D2,D$2:D$150))","v":23},{"$f":"IF($A2=\"\",\"\",'Fig 1 Ballet Leg'!H3)","v":11.719298245614036},{"$f":"IF($A2=\"\",\"\",'Fig 2 Barracuda'!H3)","v":15.877192982456142},{"$f":"IF($A2=\"\",\"\",'Fig 3 Neptunus'!H3)","v":12.789473684210527},{"$f":"IF($A2=\"\",\"\",'Fig 4 Walkover'!H3)","v":15.565789473684212},{"$f":"IF($A2=\"\",\"\",'Fig 1 Ballet Leg'!I3+'Fig 2 Barracuda'!I3+'Fig 3 Neptunus'!I3+'Fig 4 Walkover'!I3)","v":0},{"$f":"IF($A2=\"\",\"\",IF(A2=\"\",\"\",VLOOKUP(E2,AX$3:AY$102,2,FALSE)))","v":0}]
[{"$f":"IF(Draw!E3=0,\"\",Draw!E3)","v":2},"Abigail Tollas","Osseo-Maple Grove",{"$f":"IF($A3=\"\",\"\",SUM(F3:I3)-J3)","v":54.473684210526322},{"$f":"IF($A3=\"\",\"\",RANK(D3,D$2:D$150))","v":33},{"$f":"IF($A3=\"\",\"\",'Fig 1 Ballet Leg'!H4)","v":11.789473684210527},{"$f":"IF($A3=\"\",\"\",'Fig 2 Barracuda'!H4)","v":14.210526315789474},{"$f":"IF($A3=\"\",\"\",'Fig 3 Neptunus'!H4)","v":12.631578947368421},{"$f":"IF($A3=\"\",\"\",'Fig 4 Walkover'!H4)","v":15.842105263157896},{"$f":"IF($A3=\"\",\"\",'Fig 1 Ballet Leg'!I4+'Fig 2 Barracuda'!I4+'Fig 3 Neptunus'!I4+'Fig 4 Walkover'!I4)","v":0},{"$f":"IF($A3=\"\",\"\",IF(A3=\"\",\"\",VLOOKUP(E3,AX$3:AY$102,2,FALSE)))","v":0},null,null,null,null,null,null,null,null,null,null,null,null,null,null,null,null,null,null,null,null,null,null,null,null,null,null,null,null,null,null,null,null,null,null,null,null,null,null,1,8]
[3,"Tessa Crohn","Forest Lake",55.324561403508781,26,{"$f":"IF($A4=\"\",\"\",'Fig 1 Ballet Leg'!H5)","v":11.157894736842108},{"$f":"IF($A4=\"\",\"\",'Fig 2 Barracuda'!H5)","v":15.877192982456142},{"$f":"IF($A4=\"\",\"\",'Fig 3 Neptunus'!H5)","v":12.631578947368421},{"$f":"IF($A4=\"\",\"\",'Fig 4 Walkover'!H5)","v":15.657894736842106},{"$f":"IF($A4=\"\",\"\",'Fig 1 Ballet Leg'!I5+'Fig 2 Barracuda'!I5+'Fig 3 Neptunus'!I5+'Fig 4 Walkover'!I5)","v":0},0,null,null,null,null,null,null,null,null,null,null,null,null,null,null,null,null,null,null,null,null,null,null,null,null,null,null,null,null,null,null,null,null,null,null,null,null,null,null,2,6]
[4,"Ella Anderson","Forest Lake",{"$f":"IF($A5=\"\",\"\",SUM(F5:I5)-J5)","v":55.15789473684211},{"$f":"IF($A5=\"\",\"\",RANK(D5,D$2:D$150))","v":27},{"$f":"IF($A5=\"\",\"\",'Fig 1 Ballet Leg'!H6)","v":11.789473684210527},{"$f":"IF($A5=\"\",\"\",'Fig 2 Barracuda'!H6)","v":15},{"$f":"IF($A5=\"\",\"\",'Fig 3 Neptunus'!H6)","v":13.263157894736842},{"$f":"IF($A5=\"\",\"\",'Fig 4 Walkover'!H6)","v":15.105263157894738},{"$f":"IF($A5=\"\",\"\",'Fig 1 Ballet Leg'!I6+'Fig 2 Barracuda'!I6+'Fig 3 Neptunus'!I6+'Fig 4 Walkover'!I6)","v":0},{"$f":"IF($A5=\"\",\"\",IF(A5=\"\",\"\",VLOOKUP(E5,AX$3:AY$102,2,FALSE)))","v":0},null,null,null,null,null,null,null,null,null,null,null,null,null,null,null,null,null,null,null,null,null,null,null,null,null,null,null,null,null,null,null,null,null,null,null,null,null,null,3,5]
[5,"Lydia Bergeron","Forest Lake",57.048245614035096,16,{"$f":"IF($A6=\"\",\"\",'Fig 1 Ballet Leg'!H7)","v":12.070175438596493},{"$f":"IF($A6=\"\",\"\",'Fig 2 Barracuda'!H7)","v":14.649122807017545},{"$f":"IF($A6=\"\",\"\",'Fig 3 Neptunus'!H7)","v":14.210526315789474},{"$f":"IF($A6=\"\",\"\",'Fig 4 Walkover'!H7)","v":16.118421052631582},{"$f":"IF($A6=\"\",\"\",'Fig 1 Ballet Leg'!I7+'Fig 2 Barracuda'!I7+'Fig 3 Neptunus'!I7+'Fig 4 Walkover'!I7)","v":0},0,null,null,null,null,null,null,null,null,null,null,null,null,null,null,null,null,null,null,null,null,null,null,null,null,null,null,null,null,null,null,null,null,null,null,null,null,null,null,4,4]
[6,"Elena Vrba","Osseo-Maple Grove",53.885964912280699,36,{"$f":"IF($A7=\"\",\"\",'Fig 1 Ballet Leg'!H8)","v":11.578947368421053},{"$f":"IF($A7=\"\",\"\",'Fig 2 Barracuda'!H8)","v":14.12280701754386},{"$f":"IF($A7=\"\",\"\",'Fig 3 Neptunus'!H8)","v":13.263157894736842},{"$f":"IF($A7=\"\",\"\",'Fig 4 Walkover'!H8)","v":14.921052631578949},{"$f":"IF($A7=\"\",\"\",'Fig 1 Ballet Leg'!I8+'Fig 2 Barracuda'!I8+'Fig 3 Neptunus'!I8+'Fig 4 Walkover'!I8)","v":0},0,null,null,null,null,null,null,null,null,null,null,null,null,null,null,null,null,null,null,null,null,null,null,null,null,null,null,null,null,null,null,null,null,null,null,null,null,null,null,5,3]
[7,"Hannah Littel","Osseo-Maple Grove",54.780701754385973,30,{"$f":"IF($A8=\"\",\"\",'Fig 1 Ballet Leg'!H9)","v":11.228070175438598},{"$f":"IF($A8=\"\",\"\",'Fig 2 Barracuda'!H9)","v":13.684210526315789},{"$f":"IF($A8=\"\",\"\",'Fig 3 Neptunus'!H9)","v":13.657894736842106},{"$f":"IF($A8=\"\",\"\",'Fig 4 Walkover'!H9)","v":16.210526315789476},{"$f":"IF($A8=\"\",\"\",'Fig 1 Ballet Leg'!I9+'Fig 2 Barracuda'!I9+'Fig 3 Neptunus'!I9+'Fig 4 Walkover'!I9)","v":0},0,null,null,null,null,null,null,null,null,null,null,null,null,null,null,null,null,null,null,null,null,null,null,null,null,null,null,null,null,null,null,null,null,null,null,null,null,null,null,6,2]
[8,"Megan Ihfe","Forest Lake",56.21052631578948,18,{"$f":"IF($A9=\"\",\"\",'Fig 1 Ballet Leg'!H10)","v":11.649122807017546},{"$f":"IF($A9=\"\",\"\",'Fig 2 Barracuda'!H10)","v":14.561403508771932},{"$f":"IF($A9=\"\",\"\",'Fig 3 Neptunus'!H10)","v":13.973684210526317},{"$f":"IF($A9=\"\",\"\",'Fig 4 Walkover'!H10)","v":16.026315789473685},{"$f":"IF($A9=\"\",\"\",'Fig 1 Ballet Leg'!I10+'Fig 2 Barracuda'!I10+'Fig 3 Neptunus'!I10+'Fig 4 Walkover'!I10)","v":0},0,null,null,null,null,null,null,null,null,null,null,null,null,null,null,null,null,null,null,null,null,null,null,null,null,null,null,null,null,null,null,null,null,null,null,null,null,null,null,7,1]
[9,"Katherine Olsen","Osseo-Maple Grove",49.929824561403514,49,{"$f":"IF($A10=\"\",\"\",'Fig 1 Ballet Leg'!H11)","v":10.666666666666666},{"$f":"IF($A10=\"\",\"\",'Fig 2 Barracuda'!H11)","v":13.421052631578949},{"$f":"IF($A10=\"\",\"\",'Fig 3 Neptunus'!H11)","v":11.289473684210526},{"$f":"IF($A10=\"\",\"\",'Fig 4 Walkover'!H11)","v":14.552631578947368},{"$f":"IF($A10=\"\",\"\",'Fig 1 Ballet Leg'!I11+'Fig 2 Barracuda'!I11+'Fig 3 Neptunus'!I11+'Fig 4 Walkover'!I11)","v":0},0,null,null,null,null,null,null,null,null,null,null,null,null,null,null,null,null,null,null,null,null,null,null,null,null,null,null,null,null,null,null,null,null,null,null,null,null,null,null,8,0]
{"$rows_left_out":142}
{"sheet":"Draw","index":6,"n_rows":151,"n_cols":16,"rows_kept":151,"cut":false,"hidden":true,"merged":[]}
[1,"Bloomington",{"$f":"RAND()","v":0.18406528106030096},null,null,null,"School","Name","Draw #","Name","School"]
["Student Names:","Edina",{"$f":"RAND()","v":0.56056759299385883},{"$f":"IF(ISNA(RANK(C2,C$2:C$150,1)),\"\",RANK(C2,C$2:C$150,1))","v":1},{"$f":"IF(B2<>\"\",F2,\"\")","v":1},1,{"$f":"B2","v":"Edina"},{"$f":"A2","v":"Student Names:"},{"$f":"E2","v":1},{"$f":"IF(ISNA(VLOOKUP(I2,D$2:H$150,5,FALSE)),\"\",VLOOKUP(I2,D$2:H$150,5,FALSE))","v":"Student Names:"},{"$f":"IF(ISNA(VLOOKUP(I2,D$2:G$150,4,FALSE)),\"\",VLOOKUP(I2,D$2:G$150,4,FALSE))","v":"Edina"},null,null,1,"Student Names:","Edina"]
["Student Names:","Hopkins",{"$f":"RAND()","v":0.92160924543102585},{"$f":"IF(ISNA(RANK(C3,C$2:C$150,1)),\"\",RANK(C3,C$2:C$150,1))","v":2},{"$f":"IF(B3<>\"\",F3,\"\")","v":2},2,{"$f":"B3","v":"Hopkins"},{"$f":"A3","v":"Student Names:"},{"$f":"E3","v":2},{"$f":"IF(ISNA(VLOOKUP(I3,D$2:H$150,5,FALSE)),\"\",VLOOKUP(I3,D$2:H$150,5,FALSE))","v":"Student Names:"},{"$f":"IF(ISNA(VLOOKUP(I3,D$2:G$150,4,FALSE)),\"\",VLOOKUP(I3,D$2:G$150,4,FALSE))","v":"Hopkins"},null,null,2,"Student Names:","Hopkins"]
[null,null,null,"","",3,0,0,"",0,0,null,null,""]
[null,null,null,"","",4,0,0,"",0,0,null,null,""]
[null,null,null,"","",5,0,0,"",0,0,null,null,""]
[null,null,null,"","",6,0,0,"",0,0,null,null,""]
[null,null,null,"","",7,0,0,"",0,0,null,null,""]
[null,null,null,"","",8,0,0,"",0,0,null,null,""]
[null,null,null,"","",9,0,0,"",0,0,null,null,""]
{"$rows_left_out":142}
{"sheet":"Schools","index":7,"n_rows":14,"n_cols":1,"rows_kept":14,"cut":false,"hidden":true,"merged":[]}
["List of Schools:"]
["Bloomington"]
["Columbia Heights"]
["Eden Prairie"]
["Edina"]
["Forest Lake"]
["Hopkins"]
["Itasca"]
["Osseo-Maple Grove"]
["Prior Lake"]
{"$rows_left_out":5}
{"sheet":"Official Draw","index":8,"n_rows":151,"n_cols":4,"rows_kept":151,"cut":false,"hidden":false,"merged":[[0,1,0,3]]}
[null,"VARSITY - Osseo Maple Grove v. Forest Lake"]
[null,{"$f":"Draw!I1","v":"Draw #"},{"$f":"Draw!J1","v":"Name"},{"$f":"Draw!K1","v":"School"}]
[null,1,"Anna Stockinger","Forest Lake"]
[null,2,"Abigail Tollas","Osseo-Maple Grove"]
[null,3,"Tessa Crohn","Forest Lake"]
[null,4,"Ella Anderson","Forest Lake"]
[null,5,"Lydia Bergeron","Forest Lake"]
[null,6,"Elena Vrba","Osseo-Maple Grove"]
[null,7,"Hannah Littel","Osseo-Maple Grove"]
[null,8,"Megan Ihfe","Forest Lake"]
{"$rows_left_out":142}
{"sheet":"Meet Results","index":9,"n_rows":150,"n_cols":23,"rows_kept":150,"cut":false,"hidden":false,"merged":[]}
[]
[null,null,null,"Osseo-Maple Grove",{"$f":"SUMIF($F5:$G24,D2,$H5:$H24)","v":1},"Forest Lake",{"$f":"SUMIF($F5:$G24,F2,$H5:$H24)","v":28},null,null,null,"Edina",{"$f":"SUMIF($M5:$N24,K2,$O5:$O24)","v":0},"Edina",{"$f":"SUMIF($M5:$N24,M2,$O5:$O24)","v":0},null,null,null,"Hopkins",{"$f":"SUMIF($T5:$U24,R2,$V5:$V24)","v":0},"Hopkins",{"$f":"SUMIF($T5:$U24,T2,$V5:$V24)","v":0}]
[null,null,null," Total Score",null,null,null,null,null,null," Total Score",null,null,null,null,null,null," Total Score"]
[null,null,null,"#","Swimmer","School","Total","SCORE","PLACE",null,"#","Swimmer","School","Total","SCORE","PLACE",null,"#","Swimmer","School","Total","SCORE","PLACE"]
[null,null,null,29,"Andrea Dunrud","Forest Lake",67.925438596491233,{"$f":"IF(ISNA(VLOOKUP(I5,Totals!$AX$3:$AY$102,2,FALSE)),\"\",VLOOKUP(I5,Totals!$AX$3:$AY$102,2,FALSE))","v":8},{"$f":"IF(ISNA(RANK(G5,G$5:G$150)),\"\",RANK(G5,G$5:G$150))","v":1},null,29,"Andrea Dunrud","Forest Lake",67.925438596491233,{"$f":"IF(ISNA(VLOOKUP(P5,Totals!$AX$3:$AY$102,2,FALSE)),\"\",VLOOKUP(P5,Totals!$AX$3:$AY$102,2,FALSE))","v":8},{"$f":"IF(ISNA(RANK(N5,N$5:N$150)),\"\",RANK(N5,N$5:N$150))","v":1},null,29,"Andrea Dunrud","Forest Lake",67.925438596491233,{"$f":"IF(ISNA(VLOOKUP(W5,Totals!$AX$3:$AY$102,2,FALSE)),\"\",VLOOKUP(W5,Totals!$AX$3:$AY$102,2,FALSE))","v":8},{"$f":"IF(ISNA(RANK(U5,U$5:U$150)),\"\",RANK(U5,U$5:U$150))","v":1}]
[null,null,null,48,"Kenzie Klein","Forest Lake",63.94736842105263,{"$f":"IF(ISNA(VLOOKUP(I6,Totals!$AX$3:$AY$102,2,FALSE)),\"\",VLOOKUP(I6,Totals!$AX$3:$AY$102,2,FALSE))","v":6},{"$f":"IF(G6=G5,I5,IF(ISNA(RANK(G6,G$5:G$150)),\"\",RANK(G6,G$5:G$150)))","v":2},null,48,"Kenzie Klein","Forest Lake",63.94736842105263,{"$f":"IF(ISNA(VLOOKUP(P6,Totals!$AX$3:$AY$102,2,FALSE)),\"\",VLOOKUP(P6,Totals!$AX$3:$AY$102,2,FALSE))","v":6},{"$f":"IF(ISNA(RANK(N6,N$5:N$150)),\"\",RANK(N6,N$5:N$150))","v":2},null,48,"Kenzie Klein","Forest Lake",63.94736842105263,{"$f":"IF(ISNA(VLOOKUP(W6,Totals!$AX$3:$AY$102,2,FALSE)),\"\",VLOOKUP(W6,Totals!$AX$3:$AY$102,2,FALSE))","v":6},{"$f":"IF(ISNA(RANK(U6,U$5:U$150)),\"\",RANK(U6,U$5:U$150))","v":2}]
[null,null,null,54,"Fallon Olson","Forest Lake",63.798245614035082,{"$f":"IF(ISNA(VLOOKUP(I7,Totals!$AX$3:$AY$102,2,FALSE)),\"\",VLOOKUP(I7,Totals!$AX$3:$AY$102,2,FALSE))","v":5},{"$f":"IF(G7=G6,I6,IF(ISNA(RANK(G7,G$5:G$150)),\"\",RANK(G7,G$5:G$150)))","v":3},null,54,"Fallon Olson","Forest Lake",63.798245614035082,{"$f":"IF(ISNA(VLOOKUP(P7,Totals!$AX$3:$AY$102,2,FALSE)),\"\",VLOOKUP(P7,Totals!$AX$3:$AY$102,2,FALSE))","v":5},3,null,54,"Fallon Olson","Forest Lake",63.798245614035082,{"$f":"IF(ISNA(VLOOKUP(W7,Totals!$AX$3:$AY$102,2,FALSE)),\"\",VLOOKUP(W7,Totals!$AX$3:$AY$102,2,FALSE))","v":5},3]
[null,null,null,32,"Mika Peterson","Forest Lake",62.653508771929829,{"$f":"IF(ISNA(VLOOKUP(I8,Totals!$AX$3:$AY$102,2,FALSE)),\"\",VLOOKUP(I8,Totals!$AX$3:$AY$102,2,FALSE))","v":4},4,null,32,"Mika Peterson","Forest Lake",62.653508771929829,{"$f":"IF(ISNA(VLOOKUP(P8,Totals!$AX$3:$AY$102,2,FALSE)),\"\",VLOOKUP(P8,Totals!$AX$3:$AY$102,2,FALSE))","v":4},4,null,32,"Mika Peterson","Forest Lake",62.653508771929829,{"$f":"IF(ISNA(VLOOKUP(W8,Totals!$AX$3:$AY$102,2,FALSE)),\"\",VLOOKUP(W8,Totals!$AX$3:$AY$102,2,FALSE))","v":4},4]
[null,null,null,23,"Michelle Perkins","Forest Lake",61.587719298245617,{"$f":"IF(ISNA(VLOOKUP(I9,Totals!$AX$3:$AY$102,2,FALSE)),\"\",VLOOKUP(I9,Totals!$AX$3:$AY$102,2,FALSE))","v":3},5,null,23,"Michelle Perkins","Forest Lake",61.587719298245617,{"$f":"IF(ISNA(VLOOKUP(P9,Totals!$AX$3:$AY$102,2,FALSE)),\"\",VLOOKUP(P9,Totals!$AX$3:$AY$102,2,FALSE))","v":3},5,null,23,"Michelle Perkins","Forest Lake",61.587719298245617,{"$f":"IF(ISNA(VLOOKUP(W9,Totals!$AX$3:$AY$102,2,FALSE)),\"\",VLOOKUP(W9,Totals!$AX$3:$AY$102,2,FALSE))","v":3},5]
[null,null,null,26,"Dani Sardeson","Forest Lake",61.350877192982459,{"$f":"IF(ISNA(VLOOKUP(I10,Totals!$AX$3:$AY$102,2,FALSE)),\"\",VLOOKUP(I10,Totals!$AX$3:$AY$102,2,FALSE))","v":2},6,null,26,"Dani Sardeson","Forest Lake",61.350877192982459,{"$f":"IF(ISNA(VLOOKUP(P10,Totals!$AX$3:$AY$102,2,FALSE)),\"\",VLOOKUP(P10,Totals!$AX$3:$AY$102,2,FALSE))","v":2},6,null,26,"Dani Sardeson","Forest Lake",61.350877192982459,{"$f":"IF(ISNA(VLOOKUP(W10,Totals!$AX$3:$AY$102,2,FALSE)),\"\",VLOOKUP(W10,Totals!$AX$3:$AY$102,2,FALSE))","v":2},6]
{"$rows_left_out":140}