{"text_format":"1","workbook":"xlsx","n_sheets":10,"sheets":["Student Entry","Fig 1 Ballet Leg","Fig 2 Barracuda","Fig 3 Neptunus","Fig 4 Walkover","Totals","Draw","Schools","Official Draw","Meet Results"],"not_rendered":{"charts":0,"images":1,"macros":1,"external_links":0,"defined_names":4,"comments":0,"pivot_tables":1},"unopened":[],"bounds":{"document_bytes":16777216,"sheet_cells":100000,"rows_first":2000,"rows_last":500,"rows_between":2000,"halvings":0,"cell_chars":16384,"cell_head_chars":4096},"cells_cut":0,"cells_raw":0,"read":"whole","date_system":"1900"}

{"sheet":"Student Entry","index":0,"n_rows":22,"n_cols":3,"rows_kept":22,"cut":false,"hidden":false,"merged":[[0,0,0,2]]}
["Student Entry"]
["School # 1 Name:","School # 2 Name:","School # 3 Name:"]
["Columbia Heights","Osseo-Maple Grove"]
["Student Names:","Student Names:","Student Names:"]
["Samantha Alexon","Emily Barr"]
["Lily Dickson","Heather Breidenbach"]
["Issy Rardin","Holly Drazenovich"]
["Hannah Thalhuber","Anna Ganser"]
["Shakila Hoke","Danielle Hawes"]
["Ava Rosengren","Elisabeth Heitzig"]
{"$rows_left_out":13}
{"sheet":"Fig 1 Ballet Leg","index":1,"n_rows":150,"n_cols":11,"rows_kept":150,"cut":false,"hidden":false,"merged":[]}
[null,"Figure #1:","101 R/L Ballet Leg, single, *right or *left"]
["#","Degree of Difficulty","Judge 1","Judge 2","Judge 3","Judge 4","Judge 5","Score","Penalty"]
[{"$f":"IF(Draw!E2=0,\"\",Draw!E2)","v":1},1.6,61,62,61,null,null,{"$f":"IF(B3=\"\",\"\",IF(K3=5,(SUM(C3:G3)-MAX(C3:G3)-MIN(C3:G3))/3,IF(K3=4,(SUM(C3:G3)-MAX(C3:G3))/3,SUM(C3:G3)/3))*B3/7.6)","v":12.912280701754387},null,null,{"$f":"COUNT(C3:G3)","v":3}]
[{"$f":"IF(Draw!E3=0,\"\",Draw!E3)","v":2},{"$f":"IF(A4=\"\",\"\",B$3)","v":1.6},56,60,58,null,null,{"$f":"IF(B4=\"\",\"\",IF(K4=5,(SUM(C4:G4)-MAX(C4:G4)-MIN(C4:G4))/3,IF(K4=4,(SUM(C4:G4)-MAX(C4:G4))/3,SUM(C4:G4)/3))*B4/7.6)","v":12.210526315789476},null,null,{"$f":"COUNT(C4:G4)","v":3}]
[{"$f":"IF(Draw!E4=0,\"\",Draw!E4)","v":3},1.6,null,null,null,null,null,0,null,null,0]
[{"$f":"IF(Draw!E5=0,\"\",Draw!E5)","v":4},{"$f":"IF(A6=\"\",\"\",B$3)","v":1.6},57,57,58,null,null,{"$f":"IF(B6=\"\",\"\",IF(K6=5,(SUM(C6:G6)-MAX(C6:G6)-MIN(C6:G6))/3,IF(K6=4,(SUM(C6:G6)-MAX(C6:G6))/3,SUM(C6:G6)/3))*B6/7.6)","v":12.070175438596493},null,null,3]
[{"$f":"IF(Draw!E6=0,\"\",Draw!E6)","v":5},1.6,50,52,52,null,null,10.807017543859651,null,null,3]
[{"$f":"IF(Draw!E7=0,\"\",Draw!E7)","v":6},1.6,51,50,54,null,null,10.877192982456142,null,null,3]
[{"$f":"IF(Draw!E8=0,\"\",Draw!E8)","v":7},1.6,null,null,null,null,null,0,null,null,0]
[{"$f":"IF(Draw!E9=0,\"\",Draw!E9)","v":8},1.6,62,63,65,null,null,13.333333333333336,null,null,3]
{"$rows_left_out":141}
{"sheet":"Fig 2 Barracuda","index":2,"n_rows":150,"n_cols":11,"rows_kept":150,"cut":false,"hidden":false,"merged":[[0,2,0,6]]}
[null,"Figure #2:"," 301 Barracuda"]
["#","Degree of Difficulty","Judge 1","Judge 2","Judge 3","Judge 4","Judge 5","Score","Penalty"]
[{"$f":"IF(Draw!E2=0,\"\",Draw!E2)","v":1},2,58,60,59,null,null,{"$f":"IF(B3=\"\",\"\",IF(K3=5,(SUM(C3:G3)-MAX(C3:G3)-MIN(C3:G3))/3,IF(K3=4,(SUM(C3:G3)-MAX(C3:G3))/3,SUM(C3:G3)/3))*B3/7.6)","v":15.526315789473685},null,null,{"$f":"COUNT(C3:G3)","v":3}]
[{"$f":"IF(Draw!E3=0,\"\",Draw!E3)","v":2},{"$f":"IF(A4=\"\",\"\",B$3)","v":2},56,55,55,null,null,{"$f":"IF(B4=\"\",\"\",IF(K4=5,(SUM(C4:G4)-MAX(C4:G4)-MIN(C4:G4))/3,IF(K4=4,(SUM(C4:G4)-MAX(C4:G4))/3,SUM(C4:G4)/3))*B4/7.6)","v":14.561403508771932},null,null,{"$f":"COUNT(C4:G4)","v":3}]
[{"$f":"IF(Draw!E4=0,\"\",Draw!E4)","v":3},2,null,null,null,null,null,0,null,null,0]
[{"$f":"IF(Draw!E5=0,\"\",Draw!E5)","v":4},{"$f":"IF(A6=\"\",\"\",B$3)","v":2},52,52,54,null,null,{"$f":"IF(B6=\"\",\"\",IF(K6=5,(SUM(C6:G6)-MAX(C6:G6)-MIN(C6:G6))/3,IF(K6=4,(SUM(C6:G6)-MAX(C6:G6))/3,SUM(C6:G6)/3))*B6/7.6)","v":13.859649122807017},null,null,3]
[{"$f":"IF(Draw!E6=0,\"\",Draw!E6)","v":5},2,53,53,53,null,null,13.947368421052632,null,null,3]
[{"$f":"IF(Draw!E7=0,\"\",Draw!E7)","v":6},2,51,49,51,null,null,13.245614035087721,null,null,3]
[{"$f":"IF(Draw!E8=0,\"\",Draw!E8)","v":7},2,null,null,null,null,null,0,null,null,0]
[{"$f":"IF(Draw!E9=0,\"\",Draw!E9)","v":8},2,56,54,59,null,null,14.824561403508774,null,null,3]
{"$rows_left_out":141}
{"sheet":"Fig 3 Neptunus","index":3,"n_rows":150,"n_cols":11,"rows_kept":150,"cut":false,"hidden":false,"merged":[[0,2,0,6]]}
[null,"Figure #3:","344 Neptunus"]
["#","Degree of Difficulty","Judge 1","Judge 2","Judge 3","Judge 4","Judge 5","Score","Penalty"]
[{"$f":"IF(Draw!E2=0,\"\",Draw!E2)","v":1},1.8,59,60,61,null,null,{"$f":"IF(B3=\"\",\"\",IF(K3=5,(SUM(C3:G3)-MAX(C3:G3)-MIN(C3:G3))/3,IF(K3=4,(SUM(C3:G3)-MAX(C3:G3))/3,SUM(C3:G3)/3))*B3/7.6)","v":14.210526315789474},null,null,{"$f":"COUNT(C3:G3)","v":3}]
[{"$f":"IF(Draw!E3=0,\"\",Draw!E3)","v":2},{"$f":"IF(A4=\"\",\"\",B$3)","v":1.8},58,58,57,null,null,{"$f":"IF(B4=\"\",\"\",IF(K4=5,(SUM(C4:G4)-MAX(C4:G4)-MIN(C4:G4))/3,IF(K4=4,(SUM(C4:G4)-MAX(C4:G4))/3,SUM(C4:G4)/3))*B4/7.6)","v":13.657894736842106},null,null,{"$f":"COUNT(C4:G4)","v":3}]
[{"$f":"IF(Draw!E4=0,\"\",Draw!E4)","v":3},1.8,null,null,null,null,null,0,null,null,0]
[{"$f":"IF(Draw!E5=0,\"\",Draw!E5)","v":4},{"$f":"IF(A6=\"\",\"\",B$3)","v":1.8},50,52,53,null,null,{"$f":"IF(B6=\"\",\"\",IF(K6=5,(SUM(C6:G6)-MAX(C6:G6)-MIN(C6:G6))/3,IF(K6=4,(SUM(C6:G6)-MAX(C6:G6))/3,SUM(C6:G6)/3))*B6/7.6)","v":12.236842105263159},null,null,3]
[{"$f":"IF(Draw!E6=0,\"\",Draw!E6)","v":5},1.8,50,53,52,null,null,12.236842105263159,null,null,3]
[{"$f":"IF(Draw!E7=0,\"\",Draw!E7)","v":6},1.8,49,48,48,null,null,11.447368421052632,null,null,3]
[{"$f":"IF(Draw!E8=0,\"\",Draw!E8)","v":7},1.8,null,null,null,null,null,0,null,null,0]
[{"$f":"IF(Draw!E9=0,\"\",Draw!E9)","v":8},1.8,58,61,61,null,null,14.210526315789474,null,null,3]
{"$rows_left_out":141}
{"sheet":"Fig 4 Walkover","index":4,"n_rows":150,"n_cols":11,"rows_kept":150,"cut":false,"hidden":false,"merged":[[0,2,0,6]]}
[null,"Figure #4:","360 Walkover Front"]
["#","Degree of Difficulty","Judge 1","Judge 2","Judge 3","Judge 4","Judge 5","Score","Penalty"]
[{"$f":"IF(Draw!E2=0,\"\",Draw!E2)","v":1},2.1,58,58,61,null,null,{"$f":"IF(B3=\"\",\"\",IF(K3=5,(SUM(C3:G3)-MAX(C3:G3)-MIN(C3:G3))/3,IF(K3=4,(SUM(C3:G3)-MAX(C3:G3))/3,SUM(C3:G3)/3))*B3/7.6)","v":16.30263157894737},null,null,{"$f":"COUNT(C3:G3)","v":3}]
[{"$f":"IF(Draw!E3=0,\"\",Draw!E3)","v":2},{"$f":"IF(A4=\"\",\"\",B$3)","v":2.1},53,57,57,null,null,{"$f":"IF(B4=\"\",\"\",IF(K4=5,(SUM(C4:G4)-MAX(C4:G4)-MIN(C4:G4))/3,IF(K4=4,(SUM(C4:G4)-MAX(C4:G4))/3,SUM(C4:G4)/3))*B4/7.6)","v":15.381578947368423},null,null,{"$f":"COUNT(C4:G4)","v":3}]
[{"$f":"IF(Draw!E4=0,\"\",Draw!E4)","v":3},2.1,null,null,null,null,null,0,null,null,0]
[{"$f":"IF(Draw!E5=0,\"\",Draw!E5)","v":4},{"$f":"IF(A6=\"\",\"\",B$3)","v":2.1},55,56,56,null,null,{"$f":"IF(B6=\"\",\"\",IF(K6=5,(SUM(C6:G6)-MAX(C6:G6)-MIN(C6:G6))/3,IF(K6=4,(SUM(C6:G6)-MAX(C6:G6))/3,SUM(C6:G6)/3))*B6/7.6)","v":15.381578947368423},null,null,3]
[{"$f":"IF(Draw!E6=0,\"\",Draw!E6)","v":5},2.1,54,52,50,null,null,14.368421052631581,null,null,3]
[{"$f":"IF(Draw!E7=0,\"\",Draw!E7)","v":6},2.1,54,52,53,null,null,14.644736842105265,null,null,3]
[{"$f":"IF(Draw!E8=0,\"\",Draw!E8)","v":7},2.1,null,null,null,null,null,0,null,null,0]
[{"$f":"IF(Draw!E9=0,\"\",Draw!E9)","v":8},2.1,59,59,55,null,null,15.934210526315789,null,null,3]
{"$rows_left_out":141}
{"sheet":"Totals","index":5,"n_rows":151,"n_cols":51,"rows_kept":151,"cut":false,"hidden":false,"merged":[]}
["#","Swimmer","School","Total Score","Place","Figure 1","Figure 2","Figure 3","Figure 4","Penalties","Score"]
[{"$f":"IF(Draw!E2=0,\"\",Draw!E2)","v":1},"Anna Ganser","Osseo-Maple Grove",{"$f":"IF($A2=\"\",\"\",SUM(F2:I2)-J2)","v":58.951754385964918},{"$f":"IF($A2=\"\",\"\",RANK(D2,D$2:D$150))","v":2},{"$f":"IF($A2=\"\",\"\",'Fig 1 Ballet Leg'!H3)","v":12.912280701754387},{"$f":"IF($A2=\"\",\"\",'Fig 2 Barracuda'!H3)","v":15.526315789473685},{"$f":"IF($A2=\"\",\"\",'Fig 3 Neptunus'!H3)","v":14.210526315789474},{"$f":"IF($A2=\"\",\"\",'Fig 4 Walkover'!H3)","v":16.30263157894737},{"$f":"IF($A2=\"\",\"\",'Fig 1 Ballet Leg'!I3+'Fig 2 Barracuda'!I3+'Fig 3 Neptunus'!I3+'Fig 4 Walkover'!I3)","v":0},{"$f":"IF($A2=\"\",\"\",IF(A2=\"\",\"\",VLOOKUP(E2,AX$3:AY$102,2,FALSE)))","v":6}]
[{"$f":"IF(Draw!E3=0,\"\",Draw!E3)","v":2},"Abigail Tollas","Osseo-Maple Grove",{"$f":"IF($A3=\"\",\"\",SUM(F3:I3)-J3)","v":55.811403508771939},{"$f":"IF($A3=\"\",\"\",RANK(D3,D$2:D$150))","v":6},{"$f":"IF($A3=\"\",\"\",'Fig 1 Ballet Leg'!H4)","v":12.210526315789476},{"$f":"IF($A3=\"\",\"\",'Fig 2 Barracuda'!H4)","v":14.561403508771932},{"$f":"IF($A3=\"\",\"\",'Fig 3 Neptunus'!H4)","v":13.657894736842106},{"$f":"IF($A3=\"\",\"\",'Fig 4 Walkover'!H4)","v":15.381578947368423},{"$f":"IF($A3=\"\",\"\",'Fig 1 Ballet Leg'!I4+'Fig 2 Barracuda'!I4+'Fig 3 Neptunus'!I4+'Fig 4 Walkover'!I4)","v":0},{"$f":"IF($A3=\"\",\"\",IF(A3=\"\",\"\",VLOOKUP(E3,AX$3:AY$102,2,FALSE)))","v":2},null,null,null,null,null,null,null,null,null,null,null,null,null,null,null,null,null,null,null,null,null,null,null,null,null,null,null,null,null,null,null,null,null,null,null,null,null,null,1,8]
[{"$f":"IF(Draw!E4=0,\"\",Draw!E4)","v":3},"Shakila Hoke","Columbia Heights",0,21,{"$f":"IF($A4=\"\",\"\",'Fig 1 Ballet Leg'!H5)","v":0},{"$f":"IF($A4=\"\",\"\",'Fig 2 Barracuda'!H5)","v":0},{"$f":"IF($A4=\"\",\"\",'Fig 3 Neptunus'!H5)","v":0},{"$f":"IF($A4=\"\",\"\",'Fig 4 Walkover'!H5)","v":0},{"$f":"IF($A4=\"\",\"\",'Fig 1 Ballet Leg'!I5+'Fig 2 Barracuda'!I5+'Fig 3 Neptunus'!I5+'Fig 4 Walkover'!I5)","v":0},0,null,null,null,null,null,null,null,null,null,null,null,null,null,null,null,null,null,null,null,null,null,null,null,null,null,null,null,null,null,null,null,null,null,null,null,null,null,null,2,6]
[{"$f":"IF(Draw!E5=0,\"\",Draw!E5)","v":4},"Kelly McNamee","Osseo-Maple Grove",{"$f":"IF($A5=\"\",\"\",SUM(F5:I5)-J5)","v":53.548245614035096},{"$f":"IF($A5=\"\",\"\",RANK(D5,D$2:D$150))","v":10},{"$f":"IF($A5=\"\",\"\",'Fig 1 Ballet Leg'!H6)","v":12.070175438596493},{"$f":"IF($A5=\"\",\"\",'Fig 2 Barracuda'!H6)","v":13.859649122807017},{"$f":"IF($A5=\"\",\"\",'Fig 3 Neptunus'!H6)","v":12.236842105263159},{"$f":"IF($A5=\"\",\"\",'Fig 4 Walkover'!H6)","v":15.381578947368423},{"$f":"IF($A5=\"\",\"\",'Fig 1 Ballet Leg'!I6+'Fig 2 Barracuda'!I6+'Fig 3 Neptunus'!I6+'Fig 4 Walkover'!I6)","v":0},{"$f":"IF($A5=\"\",\"\",IF(A5=\"\",\"\",VLOOKUP(E5,AX$3:AY$102,2,FALSE)))","v":0},null,null,null,null,null,null,null,null,null,null,null,null,null,null,null,null,null,null,null,null,null,null,null,null,null,null,null,null,null,null,null,null,null,null,null,null,null,null,3,5]
[{"$f":"IF(Draw!E6=0,\"\",Draw!E6)","v":5},"Jessica Ruohoniemi","Osseo-Maple Grove",51.359649122807021,12,{"$f":"IF($A6=\"\",\"\",'Fig 1 Ballet Leg'!H7)","v":10.807017543859651},{"$f":"IF($A6=\"\",\"\",'Fig 2 Barracuda'!H7)","v":13.947368421052632},{"$f":"IF($A6=\"\",\"\",'Fig 3 Neptunus'!H7)","v":12.236842105263159},{"$f":"IF($A6=\"\",\"\",'Fig 4 Walkover'!H7)","v":14.368421052631581},{"$f":"IF($A6=\"\",\"\",'Fig 1 Ballet Leg'!I7+'Fig 2 Barracuda'!I7+'Fig 3 Neptunus'!I7+'Fig 4 Walkover'!I7)","v":0},0,null,null,null,null,null,null,null,null,null,null,null,null,null,null,null,null,null,null,null,null,null,null,null,null,null,null,null,null,null,null,null,null,null,null,null,null,null,null,4,4]
[{"$f":"IF(Draw!E7=0,\"\",Draw!E7)","v":6},"Katherine Olsen","Osseo-Maple Grove",50.21491228070176,15,{"$f":"IF($A7=\"\",\"\",'Fig 1 Ballet Leg'!H8)","v":10.877192982456142},{"$f":"IF($A7=\"\",\"\",'Fig 2 Barracuda'!H8)","v":13.245614035087721},{"$f":"IF($A7=\"\",\"\",'Fig 3 Neptunus'!H8)","v":11.447368421052632},{"$f":"IF($A7=\"\",\"\",'Fig 4 Walkover'!H8)","v":14.644736842105265},{"$f":"IF($A7=\"\",\"\",'Fig 1 Ballet Leg'!I8+'Fig 2 Barracuda'!I8+'Fig 3 Neptunus'!I8+'Fig 4 Walkover'!I8)","v":0},0,null,null,null,null,null,null,null,null,null,null,null,null,null,null,null,null,null,null,null,null,null,null,null,null,null,null,null,null,null,null,null,null,null,null,null,null,null,null,5,3]
[{"$f":"IF(Draw!E8=0,\"\",Draw!E8)","v":7},"Holly Drazenovich","Osseo-Maple Grove",0,21,{"$f":"IF($A8=\"\",\"\",'Fig 1 Ballet Leg'!H9)","v":0},{"$f":"IF($A8=\"\",\"\",'Fig 2 Barracuda'!H9)","v":0},{"$f":"IF($A8=\"\",\"\",'Fig 3 Neptunus'!H9)","v":0},{"$f":"IF($A8=\"\",\"\",'Fig 4 Walkover'!H9)","v":0},{"$f":"IF($A8=\"\",\"\",'Fig 1 Ballet Leg'!I9+'Fig 2 Barracuda'!I9+'Fig 3 Neptunus'!I9+'Fig 4 Walkover'!I9)","v":0},0,null,null,null,null,null,null,null,null,null,null,null,null,null,null,null,null,null,null,null,null,null,null,null,null,null,null,null,null,null,null,null,null,null,null,null,null,null,null,6,2]
[{"$f":"IF(Draw!E9=0,\"\",Draw!E9)","v":8},"Gabriela Marick","Osseo-Maple Grove",58.30263157894737,3,{"$f":"IF($A9=\"\",\"\",'Fig 1 Ballet Leg'!H10)","v":13.333333333333336},{"$f":"IF($A9=\"\",\"\",'Fig 2 Barracuda'!H10)","v":14.824561403508774},{"$f":"IF($A9=\"\",\"\",'Fig 3 Neptunus'!H10)","v":14.210526315789474},{"$f":"IF($A9=\"\",\"\",'Fig 4 Walkover'!H10)","v":15.934210526315789},{"$f":"IF($A9=\"\",\"\",'Fig 1 Ballet Leg'!I10+'Fig 2 Barracuda'!I10+'Fig 3 Neptunus'!I10+'Fig 4 Walkover'!I10)","v":0},5,null,null,null,null,null,null,null,null,null,null,null,null,null,null,null,null,null,null,null,null,null,null,null,null,null,null,null,null,null,null,null,null,null,null,null,null,null,null,7,1]
[{"$f":"IF(Draw!E10=0,\"\",Draw!E10)","v":9},"Danielle Hawes","Osseo-Maple Grove",50.771929824561404,14,{"$f":"IF($A10=\"\",\"\",'Fig 1 Ballet Leg'!H11)","v":10.17543859649123},{"$f":"IF($A10=\"\",\"\",'Fig 2 Barracuda'!H11)","v":14.385964912280702},{"$f":"IF($A10=\"\",\"\",'Fig 3 Neptunus'!H11)","v":12.394736842105264},{"$f":"IF($A10=\"\",\"\",'Fig 4 Walkover'!H11)","v":13.815789473684211},{"$f":"IF($A10=\"\",\"\",'Fig 1 Ballet Leg'!I11+'Fig 2 Barracuda'!I11+'Fig 3 Neptunus'!I11+'Fig 4 Walkover'!I11)","v":0},0,null,null,null,null,null,null,null,null,null,null,null,null,null,null,null,null,null,null,null,null,null,null,null,null,null,null,null,null,null,null,null,null,null,null,null,null,null,null,8,0]
{"$rows_left_out":142}
{"sheet":"Draw","index":6,"n_rows":151,"n_cols":16,"rows_kept":151,"cut":false,"hidden":true,"merged":[]}
[1,"Bloomington",{"$f":"RAND()","v":0.71135124794028037},null,null,null,"School","Name","Draw #","Name","School"]
["Anna Ganser","Osseo-Maple Grove",{"$f":"RAND()","v":0.77703787149520653},{"$f":"IF(ISNA(RANK(C2,C$2:C$150,1)),\"\",RANK(C2,C$2:C$150,1))","v":15},{"$f":"IF(B2<>\"\",F2,\"\")","v":1},1,{"$f":"B2","v":"Osseo-Maple Grove"},{"$f":"A2","v":"Anna Ganser"},{"$f":"E2","v":1},{"$f":"IF(ISNA(VLOOKUP(I2,D$2:H$150,5,FALSE)),\"\",VLOOKUP(I2,D$2:H$150,5,FALSE))","v":"Jessica Ruohoniemi"},{"$f":"IF(ISNA(VLOOKUP(I2,D$2:G$150,4,FALSE)),\"\",VLOOKUP(I2,D$2:G$150,4,FALSE))","v":"Osseo-Maple Grove"},null,null,1,"Anna Ganser","Osseo-Maple Grove"]
["Abigail Tollas","Osseo-Maple Grove",0.87774728024110704,{"$f":"IF(ISNA(RANK(C3,C$2:C$150,1)),\"\",RANK(C3,C$2:C$150,1))","v":18},{"$f":"IF(B3<>\"\",F3,\"\")","v":2},2,{"$f":"B3","v":"Osseo-Maple Grove"},{"$f":"A3","v":"Abigail Tollas"},{"$f":"E3","v":2},{"$f":"IF(ISNA(VLOOKUP(I3,D$2:H$150,5,FALSE)),\"\",VLOOKUP(I3,D$2:H$150,5,FALSE))","v":"Holly Drazenovich"},{"$f":"IF(ISNA(VLOOKUP(I3,D$2:G$150,4,FALSE)),\"\",VLOOKUP(I3,D$2:G$150,4,FALSE))","v":"Osseo-Maple Grove"},null,null,2,"Abigail Tollas","Osseo-Maple Grove"]
["Shakila Hoke","Columbia Heights",0.68691397818039679,14,3,3,"Columbia Heights","Shakila Hoke",3,"Emily Barr","Osseo-Maple Grove",null,null,3,"Shakila Hoke","Columbia Heights"]
["Kelly McNamee","Osseo-Maple Grove",0.79302092587446105,16,4,4,"Osseo-Maple Grove","Kelly McNamee",4,"Marie Vanderwarn","Osseo-Maple Grove",null,null,4,"Kelly McNamee","Osseo-Maple Grove"]
["Jessica Ruohoniemi","Osseo-Maple Grove",1.4956850460503546E-3,1,5,5,"Osseo-Maple Grove","Jessica Ruohoniemi",5,"Heather Breidenbach","Osseo-Maple Grove",null,null,5,"Jessica Ruohoniemi","Osseo-Maple Grove"]
["Katherine Olsen","Osseo-Maple Grove",0.3879369462828165,7,6,6,"Osseo-Maple Grove","Katherine Olsen",6,"Danielle Hawes","Osseo-Maple Grove",null,null,6,"Katherine Olsen","Osseo-Maple Grove"]
["Holly Drazenovich","Osseo-Maple Grove",1.0573021609111777E-2,2,7,7,"Osseo-Maple Grove","Holly Drazenovich",7,"Katherine Olsen","Osseo-Maple Grove",null,null,7,"Holly Drazenovich","Osseo-Maple Grove"]
["Gabriela Marick","Osseo-Maple Grove",0.42980432181789963,9,8,8,"Osseo-Maple Grove","Gabriela Marick",8,"Alexadra Trudeau","Osseo-Maple Grove",null,null,8,"Gabriela Marick","Osseo-Maple Grove"]
["Danielle Hawes","Osseo-Maple Grove",0.36561465171409246,6,9,9,"Osseo-Maple Grove","Danielle Hawes",9,"Gabriela Marick","Osseo-Maple Grove",null,null,9,"Danielle Hawes","Osseo-Maple Grove"]
{"$rows_left_out":142}
{"sheet":"Schools","index":7,"n_rows":14,"n_cols":1,"rows_kept":14,"cut":false,"hidden":true,"merged":[]}
["List of Schools:"]
["Bloomington"]
["Columbia Heights"]
["Eden Prairie"]
["Edina"]
["Forest Lake"]
["Hopkins"]
["Itasca"]
["Osseo-Maple Grove"]
["Prior Lake"]
{"$rows_left_out":5}
{"sheet":"Official Draw","index":8,"n_rows":151,"n_cols":4,"rows_kept":151,"cut":false,"hidden":false,"merged":[]}
[]
[null,{"$f":"Draw!I1","v":"Draw #"},{"$f":"Draw!J1","v":"Name"},{"$f":"Draw!K1","v":"School"}]
[null,{"$f":"Draw!N2","v":1},{"$f":"Draw!O2","v":"Anna Ganser"},{"$f":"Draw!P2","v":"Osseo-Maple Grove"}]
[null,{"$f":"Draw!N3","v":2},{"$f":"Draw!O3","v":"Abigail Tollas"},{"$f":"Draw!P3","v":"Osseo-Maple Grove"}]
[null,{"$f":"Draw!N4","v":3},{"$f":"Draw!O4","v":"Shakila Hoke"},{"$f":"Draw!P4","v":"Columbia Heights"}]
[null,{"$f":"Draw!N5","v":4},{"$f":"Draw!O5","v":"Kelly McNamee"},{"$f":"Draw!P5","v":"Osseo-Maple Grove"}]
[null,{"$f":"Draw!N6","v":5},{"$f":"Draw!O6","v":"Jessica Ruohoniemi"},{"$f":"Draw!P6","v":"Osseo-Maple Grove"}]
[null,{"$f":"Draw!N7","v":6},{"$f":"Draw!O7","v":"Katherine Olsen"},{"$f":"Draw!P7","v":"Osseo-Maple Grove"}]
[null,{"$f":"Draw!N8","v":7},{"$f":"Draw!O8","v":"Holly Drazenovich"},{"$f":"Draw!P8","v":"Osseo-Maple Grove"}]
[null,{"$f":"Draw!N9","v":8},{"$f":"Draw!O9","v":"Gabriela Marick"},{"$f":"Draw!P9","v":"Osseo-Maple Grove"}]
{"$rows_left_out":142}
{"sheet":"Meet Results","index":9,"n_rows":150,"n_cols":9,"rows_kept":150,"cut":false,"hidden":false,"merged":[]}
[]
[null,null,null,"Columbia Heights",{"$f":"SUMIF($F5:$G24,D2,$H5:$H24)","v":0},"Stillwater",{"$f":"SUMIF($F5:$G24,F2,$H5:$H24)","v":0}]
[null,null,null," Total Score"]
[null,null,null,"#","Swimmer","School","Total","SCORE","PLACE"]
[null,null,null,22,"Elizabeth McBride","Osseo-Maple Grove",60.859649122807028,{"$f":"IF(ISNA(VLOOKUP(I5,Totals!$AX$3:$AY$102,2,FALSE)),\"\",VLOOKUP(I5,Totals!$AX$3:$AY$102,2,FALSE))","v":8},{"$f":"IF(ISNA(RANK(G5,G$5:G$150)),\"\",RANK(G5,G$5:G$150))","v":1}]
[null,null,null,1,"Anna Ganser","Osseo-Maple Grove",58.951754385964918,{"$f":"IF(ISNA(VLOOKUP(I6,Totals!$AX$3:$AY$102,2,FALSE)),\"\",VLOOKUP(I6,Totals!$AX$3:$AY$102,2,FALSE))","v":6},{"$f":"IF(G6=G5,I5,IF(ISNA(RANK(G6,G$5:G$150)),\"\",RANK(G6,G$5:G$150)))","v":2}]
[null,null,null,8,"Gabriela Marick","Osseo-Maple Grove",58.30263157894737,{"$f":"IF(ISNA(VLOOKUP(I7,Totals!$AX$3:$AY$102,2,FALSE)),\"\",VLOOKUP(I7,Totals!$AX$3:$AY$102,2,FALSE))","v":5},{"$f":"IF(G7=G6,I6,IF(ISNA(RANK(G7,G$5:G$150)),\"\",RANK(G7,G$5:G$150)))","v":3}]
[null,null,null,24,"Alexadra Trudeau","Osseo-Maple Grove",56.605263157894747,{"$f":"IF(ISNA(VLOOKUP(I8,Totals!$AX$3:$AY$102,2,FALSE)),\"\",VLOOKUP(I8,Totals!$AX$3:$AY$102,2,FALSE))","v":4},4]
[null,null,null,16,"Elisabeth Heitzig","Osseo-Maple Grove",56.01754385964913,{"$f":"IF(ISNA(VLOOKUP(I9,Totals!$AX$3:$AY$102,2,FALSE)),\"\",VLOOKUP(I9,Totals!$AX$3:$AY$102,2,FALSE))","v":3},5]
[null,null,null,2,"Abigail Tollas","Osseo-Maple Grove",55.811403508771939,{"$f":"IF(ISNA(VLOOKUP(I10,Totals!$AX$3:$AY$102,2,FALSE)),\"\",VLOOKUP(I10,Totals!$AX$3:$AY$102,2,FALSE))","v":2},6]
{"$rows_left_out":140}