{"text_format":"1","workbook":"xlsx","n_sheets":10,"sheets":["Student Entry","Fig 1 Ballet Leg","Fig 2 Barracuda","Fig 3 Tower","Fig 4 Walkover","Totals","Draw","Schools","Official Draw","Meet Results"],"not_rendered":{"charts":0,"images":1,"macros":1,"external_links":0,"defined_names":8,"comments":0,"pivot_tables":3},"unopened":[],"bounds":{"document_bytes":16777216,"sheet_cells":100000,"rows_first":2000,"rows_last":500,"rows_between":2000,"halvings":0,"cell_chars":16384,"cell_head_chars":4096},"cells_cut":0,"cells_raw":0,"read":"whole","date_system":"1900"}

{"sheet":"Student Entry","index":0,"n_rows":39,"n_cols":3,"rows_kept":39,"cut":false,"hidden":false,"merged":[[0,0,0,2]]}
["Student Entry"]
["School # 1 Name:","School # 2 Name:","School # 3 Name:"]
["Osseo-Maple Grove","Stillwater"]
["Student Names:","Student Names:","Student Names:"]
["Breidenbach, Heather","Rubie Ballantyne"]
["Drazenovich, Holly","Miranda Bergan"]
["Ganser, Anna","Ellie Bliss"]
["Hammann, Allison","Greta Bliss"]
["Hawes, Danielle","Sophie Browning"]
["Heiss, Hayley","Linnea Coltvet"]
{"$rows_left_out":30}
{"sheet":"Fig 1 Ballet Leg","index":1,"n_rows":150,"n_cols":11,"rows_kept":150,"cut":false,"hidden":false,"merged":[]}
[null,"Figure #1:","101 R/L Ballet Leg, single, *right or *left"]
["#","Degree of Difficulty","Judge 1","Judge 2","Judge 3","Judge 4","Judge 5","Score","Penalty"]
[{"$f":"IF(Draw!E2=0,\"\",Draw!E2)","v":1},1.6,56,57,59,null,null,{"$f":"IF(B3=\"\",\"\",IF(K3=5,(SUM(C3:G3)-MAX(C3:G3)-MIN(C3:G3))/3,IF(K3=4,(SUM(C3:G3)-MAX(C3:G3))/3,SUM(C3:G3)/3))*B3/7.6)","v":12.070175438596493},null,null,{"$f":"COUNT(C3:G3)","v":3}]
[{"$f":"IF(Draw!E3=0,\"\",Draw!E3)","v":2},{"$f":"IF(A4=\"\",\"\",B$3)","v":1.6},49,50,48,null,null,{"$f":"IF(B4=\"\",\"\",IF(K4=5,(SUM(C4:G4)-MAX(C4:G4)-MIN(C4:G4))/3,IF(K4=4,(SUM(C4:G4)-MAX(C4:G4))/3,SUM(C4:G4)/3))*B4/7.6)","v":10.315789473684212},null,null,{"$f":"COUNT(C4:G4)","v":3}]
[{"$f":"IF(Draw!E4=0,\"\",Draw!E4)","v":3},{"$f":"IF(A5=\"\",\"\",B$3)","v":1.6},61,60,59,null,null,12.631578947368421,null,null,3]
[{"$f":"IF(Draw!E5=0,\"\",Draw!E5)","v":4},1.6,54,56,51,null,null,{"$f":"IF(B6=\"\",\"\",IF(K6=5,(SUM(C6:G6)-MAX(C6:G6)-MIN(C6:G6))/3,IF(K6=4,(SUM(C6:G6)-MAX(C6:G6))/3,SUM(C6:G6)/3))*B6/7.6)","v":11.298245614035089},null,null,3]
[{"$f":"IF(Draw!E6=0,\"\",Draw!E6)","v":5},{"$f":"IF(A7=\"\",\"\",B$3)","v":1.6},58,62,63,null,null,12.842105263157896,null,null,3]
[{"$f":"IF(Draw!E7=0,\"\",Draw!E7)","v":6},1.6,61,60,65,null,null,13.05263157894737,null,null,3]
[{"$f":"IF(Draw!E8=0,\"\",Draw!E8)","v":7},1.6,52,56,54,null,null,11.368421052631581,null,null,3]
[{"$f":"IF(Draw!E9=0,\"\",Draw!E9)","v":8},1.6,57,55,58,null,null,11.92982456140351,null,null,3]
{"$rows_left_out":141}
{"sheet":"Fig 2 Barracuda","index":2,"n_rows":150,"n_cols":11,"rows_kept":150,"cut":false,"hidden":false,"merged":[[0,2,0,6]]}
[null,"Figure #2:","301 Barracuda"]
["#","Degree of Difficulty","Judge 1","Judge 2","Judge 3","Judge 4","Judge 5","Score","Penalty"]
[{"$f":"IF(Draw!E2=0,\"\",Draw!E2)","v":1},2,58,63,58,59,60,{"$f":"IF(B3=\"\",\"\",IF(K3=5,(SUM(C3:G3)-MAX(C3:G3)-MIN(C3:G3))/3,IF(K3=4,(SUM(C3:G3)-MAX(C3:G3))/3,SUM(C3:G3)/3))*B3/7.6)","v":15.526315789473685},null,null,{"$f":"COUNT(C3:G3)","v":5}]
[{"$f":"IF(Draw!E3=0,\"\",Draw!E3)","v":2},{"$f":"IF(A4=\"\",\"\",B$3)","v":2},50,52,52,53,56,{"$f":"IF(B4=\"\",\"\",IF(K4=5,(SUM(C4:G4)-MAX(C4:G4)-MIN(C4:G4))/3,IF(K4=4,(SUM(C4:G4)-MAX(C4:G4))/3,SUM(C4:G4)/3))*B4/7.6)","v":13.771929824561404},null,null,{"$f":"COUNT(C4:G4)","v":5}]
[{"$f":"IF(Draw!E4=0,\"\",Draw!E4)","v":3},{"$f":"IF(A5=\"\",\"\",B$3)","v":2},55,59,56,57,56,{"$f":"IF(B5=\"\",\"\",IF(K5=5,(SUM(C5:G5)-MAX(C5:G5)-MIN(C5:G5))/3,IF(K5=4,(SUM(C5:G5)-MAX(C5:G5))/3,SUM(C5:G5)/3))*B5/7.6)","v":14.824561403508774},null,null,5]
[{"$f":"IF(Draw!E5=0,\"\",Draw!E5)","v":4},2,48,48,48,52,54,{"$f":"IF(B6=\"\",\"\",IF(K6=5,(SUM(C6:G6)-MAX(C6:G6)-MIN(C6:G6))/3,IF(K6=4,(SUM(C6:G6)-MAX(C6:G6))/3,SUM(C6:G6)/3))*B6/7.6)","v":12.982456140350878},null,null,5]
[{"$f":"IF(Draw!E6=0,\"\",Draw!E6)","v":5},{"$f":"IF(A7=\"\",\"\",B$3)","v":2},62,64,63,65,61,{"$f":"IF(B7=\"\",\"\",IF(K7=5,(SUM(C7:G7)-MAX(C7:G7)-MIN(C7:G7))/3,IF(K7=4,(SUM(C7:G7)-MAX(C7:G7))/3,SUM(C7:G7)/3))*B7/7.6)","v":16.578947368421055},null,null,5]
[{"$f":"IF(Draw!E7=0,\"\",Draw!E7)","v":6},2,61,65,65,66,62,{"$f":"IF(B8=\"\",\"\",IF(K8=5,(SUM(C8:G8)-MAX(C8:G8)-MIN(C8:G8))/3,IF(K8=4,(SUM(C8:G8)-MAX(C8:G8))/3,SUM(C8:G8)/3))*B8/7.6)","v":16.842105263157894},null,null,5]
[{"$f":"IF(Draw!E8=0,\"\",Draw!E8)","v":7},2,49,55,47,48,51,{"$f":"IF(B9=\"\",\"\",IF(K9=5,(SUM(C9:G9)-MAX(C9:G9)-MIN(C9:G9))/3,IF(K9=4,(SUM(C9:G9)-MAX(C9:G9))/3,SUM(C9:G9)/3))*B9/7.6)","v":12.982456140350878},null,null,5]
[{"$f":"IF(Draw!E9=0,\"\",Draw!E9)","v":8},2,63,63,58,62,55,{"$f":"IF(B10=\"\",\"\",IF(K10=5,(SUM(C10:G10)-MAX(C10:G10)-MIN(C10:G10))/3,IF(K10=4,(SUM(C10:G10)-MAX(C10:G10))/3,SUM(C10:G10)/3))*B10/7.6)","v":16.05263157894737},null,null,5]
{"$rows_left_out":141}
{"sheet":"Fig 3 Tower","index":3,"n_rows":150,"n_cols":11,"rows_kept":150,"cut":false,"hidden":false,"merged":[[0,2,0,6]]}
[null,"Figure #3:","349 Tower"]
["#","Degree of Difficulty","Judge 1","Judge 2","Judge 3","Judge 4","Judge 5","Score","Penalty"]
[{"$f":"IF(Draw!E2=0,\"\",Draw!E2)","v":1},1.9,58,61,61,null,null,{"$f":"IF(B3=\"\",\"\",IF(K3=5,(SUM(C3:G3)-MAX(C3:G3)-MIN(C3:G3))/3,IF(K3=4,(SUM(C3:G3)-MAX(C3:G3))/3,SUM(C3:G3)/3))*B3/7.6)","v":15},null,null,{"$f":"COUNT(C3:G3)","v":3}]
[{"$f":"IF(Draw!E3=0,\"\",Draw!E3)","v":2},{"$f":"IF(A4=\"\",\"\",B$3)","v":1.9},47,44,42,null,null,{"$f":"IF(B4=\"\",\"\",IF(K4=5,(SUM(C4:G4)-MAX(C4:G4)-MIN(C4:G4))/3,IF(K4=4,(SUM(C4:G4)-MAX(C4:G4))/3,SUM(C4:G4)/3))*B4/7.6)","v":11.083333333333334},null,null,{"$f":"COUNT(C4:G4)","v":3}]
[{"$f":"IF(Draw!E4=0,\"\",Draw!E4)","v":3},{"$f":"IF(A5=\"\",\"\",B$3)","v":1.9},55,53,56,null,null,{"$f":"IF(B5=\"\",\"\",IF(K5=5,(SUM(C5:G5)-MAX(C5:G5)-MIN(C5:G5))/3,IF(K5=4,(SUM(C5:G5)-MAX(C5:G5))/3,SUM(C5:G5)/3))*B5/7.6)","v":13.666666666666666},null,null,3]
[{"$f":"IF(Draw!E5=0,\"\",Draw!E5)","v":4},1.9,56,55,55,null,null,{"$f":"IF(B6=\"\",\"\",IF(K6=5,(SUM(C6:G6)-MAX(C6:G6)-MIN(C6:G6))/3,IF(K6=4,(SUM(C6:G6)-MAX(C6:G6))/3,SUM(C6:G6)/3))*B6/7.6)","v":13.833333333333336},null,null,3]
[{"$f":"IF(Draw!E6=0,\"\",Draw!E6)","v":5},{"$f":"IF(A7=\"\",\"\",B$3)","v":1.9},57,63,65,null,null,{"$f":"IF(B7=\"\",\"\",IF(K7=5,(SUM(C7:G7)-MAX(C7:G7)-MIN(C7:G7))/3,IF(K7=4,(SUM(C7:G7)-MAX(C7:G7))/3,SUM(C7:G7)/3))*B7/7.6)","v":15.416666666666666},null,null,3]
[{"$f":"IF(Draw!E7=0,\"\",Draw!E7)","v":6},1.9,55,61,61,null,null,{"$f":"IF(B8=\"\",\"\",IF(K8=5,(SUM(C8:G8)-MAX(C8:G8)-MIN(C8:G8))/3,IF(K8=4,(SUM(C8:G8)-MAX(C8:G8))/3,SUM(C8:G8)/3))*B8/7.6)","v":14.75},null,null,3]
[{"$f":"IF(Draw!E8=0,\"\",Draw!E8)","v":7},1.9,56,56,55,null,null,{"$f":"IF(B9=\"\",\"\",IF(K9=5,(SUM(C9:G9)-MAX(C9:G9)-MIN(C9:G9))/3,IF(K9=4,(SUM(C9:G9)-MAX(C9:G9))/3,SUM(C9:G9)/3))*B9/7.6)","v":13.916666666666666},null,null,3]
[{"$f":"IF(Draw!E9=0,\"\",Draw!E9)","v":8},1.9,59,57,55,null,null,{"$f":"IF(B10=\"\",\"\",IF(K10=5,(SUM(C10:G10)-MAX(C10:G10)-MIN(C10:G10))/3,IF(K10=4,(SUM(C10:G10)-MAX(C10:G10))/3,SUM(C10:G10)/3))*B10/7.6)","v":14.25},null,null,3]
{"$rows_left_out":141}
{"sheet":"Fig 4 Walkover","index":4,"n_rows":150,"n_cols":11,"rows_kept":150,"cut":false,"hidden":false,"merged":[[0,2,0,6]]}
[null,"Figure #4:","360 Walkover Front"]
["#","Degree of Difficulty","Judge 1","Judge 2","Judge 3","Judge 4","Judge 5","Score","Penalty"]
[{"$f":"IF(Draw!E2=0,\"\",Draw!E2)","v":1},2.1,58,57,58,57,55,{"$f":"IF(B3=\"\",\"\",IF(K3=5,(SUM(C3:G3)-MAX(C3:G3)-MIN(C3:G3))/3,IF(K3=4,(SUM(C3:G3)-MAX(C3:G3))/3,SUM(C3:G3)/3))*B3/7.6)","v":15.842105263157896},null,null,{"$f":"COUNT(C3:G3)","v":5}]
[{"$f":"IF(Draw!E3=0,\"\",Draw!E3)","v":2},{"$f":"IF(A4=\"\",\"\",B$3)","v":2.1},51,50,53,54,54,{"$f":"IF(B4=\"\",\"\",IF(K4=5,(SUM(C4:G4)-MAX(C4:G4)-MIN(C4:G4))/3,IF(K4=4,(SUM(C4:G4)-MAX(C4:G4))/3,SUM(C4:G4)/3))*B4/7.6)","v":14.552631578947368},null,null,{"$f":"COUNT(C4:G4)","v":5}]
[{"$f":"IF(Draw!E4=0,\"\",Draw!E4)","v":3},{"$f":"IF(A5=\"\",\"\",B$3)","v":2.1},56,55,54,57,58,{"$f":"IF(B5=\"\",\"\",IF(K5=5,(SUM(C5:G5)-MAX(C5:G5)-MIN(C5:G5))/3,IF(K5=4,(SUM(C5:G5)-MAX(C5:G5))/3,SUM(C5:G5)/3))*B5/7.6)","v":15.473684210526317},null,null,5]
[{"$f":"IF(Draw!E5=0,\"\",Draw!E5)","v":4},2.1,56,49,51,52,51,{"$f":"IF(B6=\"\",\"\",IF(K6=5,(SUM(C6:G6)-MAX(C6:G6)-MIN(C6:G6))/3,IF(K6=4,(SUM(C6:G6)-MAX(C6:G6))/3,SUM(C6:G6)/3))*B6/7.6)","v":14.184210526315791},null,null,5]
[{"$f":"IF(Draw!E6=0,\"\",Draw!E6)","v":5},{"$f":"IF(A7=\"\",\"\",B$3)","v":2.1},62,70,68,67,63,{"$f":"IF(B7=\"\",\"\",IF(K7=5,(SUM(C7:G7)-MAX(C7:G7)-MIN(C7:G7))/3,IF(K7=4,(SUM(C7:G7)-MAX(C7:G7))/3,SUM(C7:G7)/3))*B7/7.6)","v":18.236842105263158},null,null,5]
[{"$f":"IF(Draw!E7=0,\"\",Draw!E7)","v":6},2.1,63,65,64,63,62,{"$f":"IF(B8=\"\",\"\",IF(K8=5,(SUM(C8:G8)-MAX(C8:G8)-MIN(C8:G8))/3,IF(K8=4,(SUM(C8:G8)-MAX(C8:G8))/3,SUM(C8:G8)/3))*B8/7.6)","v":17.5},null,null,5]
[{"$f":"IF(Draw!E8=0,\"\",Draw!E8)","v":7},2.1,49,50,50,50,50,{"$f":"IF(B9=\"\",\"\",IF(K9=5,(SUM(C9:G9)-MAX(C9:G9)-MIN(C9:G9))/3,IF(K9=4,(SUM(C9:G9)-MAX(C9:G9))/3,SUM(C9:G9)/3))*B9/7.6)","v":13.815789473684211},null,null,5]
[{"$f":"IF(Draw!E9=0,\"\",Draw!E9)","v":8},2.1,61,62,56,59,62,{"$f":"IF(B10=\"\",\"\",IF(K10=5,(SUM(C10:G10)-MAX(C10:G10)-MIN(C10:G10))/3,IF(K10=4,(SUM(C10:G10)-MAX(C10:G10))/3,SUM(C10:G10)/3))*B10/7.6)","v":16.763157894736842},null,null,5]
{"$rows_left_out":141}
{"sheet":"Totals","index":5,"n_rows":151,"n_cols":51,"rows_kept":151,"cut":false,"hidden":false,"merged":[]}
["#","Swimmer","School","Total Score","Place","Figure 1","Figure 2","Figure 3","Figure 4","Penalties","Score"]
[{"$f":"IF(Draw!E2=0,\"\",Draw!E2)","v":1},"Grace Henke","Stillwater",{"$f":"IF($A2=\"\",\"\",SUM(F2:I2)-J2)","v":58.438596491228076},{"$f":"IF($A2=\"\",\"\",RANK(D2,D$2:D$150))","v":15},{"$f":"IF($A2=\"\",\"\",'Fig 1 Ballet Leg'!H3)","v":12.070175438596493},{"$f":"IF($A2=\"\",\"\",'Fig 2 Barracuda'!H3)","v":15.526315789473685},{"$f":"IF($A2=\"\",\"\",'Fig 3 Tower'!H3)","v":15},{"$f":"IF($A2=\"\",\"\",'Fig 4 Walkover'!H3)","v":15.842105263157896},{"$f":"IF($A2=\"\",\"\",'Fig 1 Ballet Leg'!I3+'Fig 2 Barracuda'!I3+'Fig 3 Tower'!I3+'Fig 4 Walkover'!I3)","v":0},{"$f":"IF($A2=\"\",\"\",IF(A2=\"\",\"\",VLOOKUP(E2,AX$3:AY$102,2,FALSE)))","v":0}]
[{"$f":"IF(Draw!E3=0,\"\",Draw!E3)","v":2},"Drazenovich, Holly","Osseo-Maple Grove",{"$f":"IF($A3=\"\",\"\",SUM(F3:I3)-J3)","v":49.723684210526322},{"$f":"IF($A3=\"\",\"\",RANK(D3,D$2:D$150))","v":53},{"$f":"IF($A3=\"\",\"\",'Fig 1 Ballet Leg'!H4)","v":10.315789473684212},{"$f":"IF($A3=\"\",\"\",'Fig 2 Barracuda'!H4)","v":13.771929824561404},{"$f":"IF($A3=\"\",\"\",'Fig 3 Tower'!H4)","v":11.083333333333334},{"$f":"IF($A3=\"\",\"\",'Fig 4 Walkover'!H4)","v":14.552631578947368},{"$f":"IF($A3=\"\",\"\",'Fig 1 Ballet Leg'!I4+'Fig 2 Barracuda'!I4+'Fig 3 Tower'!I4+'Fig 4 Walkover'!I4)","v":0},{"$f":"IF($A3=\"\",\"\",IF(A3=\"\",\"\",VLOOKUP(E3,AX$3:AY$102,2,FALSE)))","v":0},null,null,null,null,null,null,null,null,null,null,null,null,null,null,null,null,null,null,null,null,null,null,null,null,null,null,null,null,null,null,null,null,null,null,null,null,null,null,1,8]
[{"$f":"IF(Draw!E4=0,\"\",Draw!E4)","v":3},"Carolyn Wrightsman","Stillwater",56.596491228070178,25,{"$f":"IF($A4=\"\",\"\",'Fig 1 Ballet Leg'!H5)","v":12.631578947368421},{"$f":"IF($A4=\"\",\"\",'Fig 2 Barracuda'!H5)","v":14.824561403508774},{"$f":"IF($A4=\"\",\"\",'Fig 3 Tower'!H5)","v":13.666666666666666},{"$f":"IF($A4=\"\",\"\",'Fig 4 Walkover'!H5)","v":15.473684210526317},{"$f":"IF($A4=\"\",\"\",'Fig 1 Ballet Leg'!I5+'Fig 2 Barracuda'!I5+'Fig 3 Tower'!I5+'Fig 4 Walkover'!I5)","v":0},0,null,null,null,null,null,null,null,null,null,null,null,null,null,null,null,null,null,null,null,null,null,null,null,null,null,null,null,null,null,null,null,null,null,null,null,null,null,null,2,6]
[{"$f":"IF(Draw!E5=0,\"\",Draw!E5)","v":4},"Ruohoniemi, Jessica (Jess)","Osseo-Maple Grove",{"$f":"IF($A5=\"\",\"\",SUM(F5:I5)-J5)","v":52.298245614035096},{"$f":"IF($A5=\"\",\"\",RANK(D5,D$2:D$150))","v":43},{"$f":"IF($A5=\"\",\"\",'Fig 1 Ballet Leg'!H6)","v":11.298245614035089},{"$f":"IF($A5=\"\",\"\",'Fig 2 Barracuda'!H6)","v":12.982456140350878},{"$f":"IF($A5=\"\",\"\",'Fig 3 Tower'!H6)","v":13.833333333333336},{"$f":"IF($A5=\"\",\"\",'Fig 4 Walkover'!H6)","v":14.184210526315791},{"$f":"IF($A5=\"\",\"\",'Fig 1 Ballet Leg'!I6+'Fig 2 Barracuda'!I6+'Fig 3 Tower'!I6+'Fig 4 Walkover'!I6)","v":0},{"$f":"IF($A5=\"\",\"\",IF(A5=\"\",\"\",VLOOKUP(E5,AX$3:AY$102,2,FALSE)))","v":0},null,null,null,null,null,null,null,null,null,null,null,null,null,null,null,null,null,null,null,null,null,null,null,null,null,null,null,null,null,null,null,null,null,null,null,null,null,null,3,5]
[{"$f":"IF(Draw!E6=0,\"\",Draw!E6)","v":5},"Grace Zimmer","Stillwater",63.074561403508774,3,{"$f":"IF($A6=\"\",\"\",'Fig 1 Ballet Leg'!H7)","v":12.842105263157896},{"$f":"IF($A6=\"\",\"\",'Fig 2 Barracuda'!H7)","v":16.578947368421055},{"$f":"IF($A6=\"\",\"\",'Fig 3 Tower'!H7)","v":15.416666666666666},{"$f":"IF($A6=\"\",\"\",'Fig 4 Walkover'!H7)","v":18.236842105263158},{"$f":"IF($A6=\"\",\"\",'Fig 1 Ballet Leg'!I7+'Fig 2 Barracuda'!I7+'Fig 3 Tower'!I7+'Fig 4 Walkover'!I7)","v":0},5,null,null,null,null,null,null,null,null,null,null,null,null,null,null,null,null,null,null,null,null,null,null,null,null,null,null,null,null,null,null,null,null,null,null,null,null,null,null,4,4]
[{"$f":"IF(Draw!E7=0,\"\",Draw!E7)","v":6},"Grace Gualtieri","Stillwater",62.14473684210526,6,{"$f":"IF($A7=\"\",\"\",'Fig 1 Ballet Leg'!H8)","v":13.05263157894737},{"$f":"IF($A7=\"\",\"\",'Fig 2 Barracuda'!H8)","v":16.842105263157894},{"$f":"IF($A7=\"\",\"\",'Fig 3 Tower'!H8)","v":14.75},{"$f":"IF($A7=\"\",\"\",'Fig 4 Walkover'!H8)","v":17.5},{"$f":"IF($A7=\"\",\"\",'Fig 1 Ballet Leg'!I8+'Fig 2 Barracuda'!I8+'Fig 3 Tower'!I8+'Fig 4 Walkover'!I8)","v":0},2,null,null,null,null,null,null,null,null,null,null,null,null,null,null,null,null,null,null,null,null,null,null,null,null,null,null,null,null,null,null,null,null,null,null,null,null,null,null,5,3]
[{"$f":"IF(Draw!E8=0,\"\",Draw!E8)","v":7},"Jane Sorenson","Stillwater",52.083333333333336,45,{"$f":"IF($A8=\"\",\"\",'Fig 1 Ballet Leg'!H9)","v":11.368421052631581},{"$f":"IF($A8=\"\",\"\",'Fig 2 Barracuda'!H9)","v":12.982456140350878},{"$f":"IF($A8=\"\",\"\",'Fig 3 Tower'!H9)","v":13.916666666666666},{"$f":"IF($A8=\"\",\"\",'Fig 4 Walkover'!H9)","v":13.815789473684211},{"$f":"IF($A8=\"\",\"\",'Fig 1 Ballet Leg'!I9+'Fig 2 Barracuda'!I9+'Fig 3 Tower'!I9+'Fig 4 Walkover'!I9)","v":0},0,null,null,null,null,null,null,null,null,null,null,null,null,null,null,null,null,null,null,null,null,null,null,null,null,null,null,null,null,null,null,null,null,null,null,null,null,null,null,6,2]
[{"$f":"IF(Draw!E9=0,\"\",Draw!E9)","v":8},"Rubie Ballantyne","Stillwater",58.995614035087719,12,{"$f":"IF($A9=\"\",\"\",'Fig 1 Ballet Leg'!H10)","v":11.92982456140351},{"$f":"IF($A9=\"\",\"\",'Fig 2 Barracuda'!H10)","v":16.05263157894737},{"$f":"IF($A9=\"\",\"\",'Fig 3 Tower'!H10)","v":14.25},{"$f":"IF($A9=\"\",\"\",'Fig 4 Walkover'!H10)","v":16.763157894736842},{"$f":"IF($A9=\"\",\"\",'Fig 1 Ballet Leg'!I10+'Fig 2 Barracuda'!I10+'Fig 3 Tower'!I10+'Fig 4 Walkover'!I10)","v":0},0,null,null,null,null,null,null,null,null,null,null,null,null,null,null,null,null,null,null,null,null,null,null,null,null,null,null,null,null,null,null,null,null,null,null,null,null,null,null,7,1]
[{"$f":"IF(Draw!E10=0,\"\",Draw!E10)","v":9},"Hannah Dettmann","Stillwater",58.938596491228083,13,{"$f":"IF($A10=\"\",\"\",'Fig 1 Ballet Leg'!H11)","v":11.92982456140351},{"$f":"IF($A10=\"\",\"\",'Fig 2 Barracuda'!H11)","v":15.964912280701755},{"$f":"IF($A10=\"\",\"\",'Fig 3 Tower'!H11)","v":14.833333333333334},{"$f":"IF($A10=\"\",\"\",'Fig 4 Walkover'!H11)","v":16.210526315789476},{"$f":"IF($A10=\"\",\"\",'Fig 1 Ballet Leg'!I11+'Fig 2 Barracuda'!I11+'Fig 3 Tower'!I11+'Fig 4 Walkover'!I11)","v":0},0,null,null,null,null,null,null,null,null,null,null,null,null,null,null,null,null,null,null,null,null,null,null,null,null,null,null,null,null,null,null,null,null,null,null,null,null,null,null,8,0]
{"$rows_left_out":142}
{"sheet":"Draw","index":6,"n_rows":151,"n_cols":16,"rows_kept":151,"cut":false,"hidden":true,"merged":[]}
[1,"Bloomington",{"$f":"RAND()","v":0.92348078595811101},null,null,null,"School","Name","Draw #","Name","School"]
["Grace Henke","Stillwater",{"$f":"RAND()","v":0.70949531630243501},{"$f":"IF(ISNA(RANK(C2,C$2:C$150,1)),\"\",RANK(C2,C$2:C$150,1))","v":40},{"$f":"IF(B2<>\"\",F2,\"\")","v":1},1,{"$f":"B2","v":"Stillwater"},{"$f":"A2","v":"Grace Henke"},{"$f":"E2","v":1},{"$f":"IF(ISNA(VLOOKUP(I2,D$2:H$150,5,FALSE)),\"\",VLOOKUP(I2,D$2:H$150,5,FALSE))","v":"Waldron, Zoe"},{"$f":"IF(ISNA(VLOOKUP(I2,D$2:G$150,4,FALSE)),\"\",VLOOKUP(I2,D$2:G$150,4,FALSE))","v":"Osseo-Maple Grove"},null,null,1,"Grace Henke","Stillwater"]
["Drazenovich, Holly","Osseo-Maple Grove",{"$f":"RAND()","v":0.90336238195726515},{"$f":"IF(ISNA(RANK(C3,C$2:C$150,1)),\"\",RANK(C3,C$2:C$150,1))","v":52},{"$f":"IF(B3<>\"\",F3,\"\")","v":2},2,{"$f":"B3","v":"Osseo-Maple Grove"},{"$f":"A3","v":"Drazenovich, Holly"},{"$f":"E3","v":2},{"$f":"IF(ISNA(VLOOKUP(I3,D$2:H$150,5,FALSE)),\"\",VLOOKUP(I3,D$2:H$150,5,FALSE))","v":"Peters, Madison"},{"$f":"IF(ISNA(VLOOKUP(I3,D$2:G$150,4,FALSE)),\"\",VLOOKUP(I3,D$2:G$150,4,FALSE))","v":"Osseo-Maple Grove"},null,null,2,"Drazenovich, Holly","Osseo-Maple Grove"]
["Carolyn Wrightsman","Stillwater",3.1E-2,3,3,3,"Stillwater","Carolyn Wrightsman",3,"Carolyn Wrightsman","Stillwater",null,null,3,"Carolyn Wrightsman","Stillwater"]
["Ruohoniemi, Jessica (Jess)","Osseo-Maple Grove",{"$f":"RAND()","v":0.92708441532986496},55,4,4,"Osseo-Maple Grove","Ruohoniemi, Jessica (Jess)",4,"Grace Zimmer","Stillwater",null,null,4,"Ruohoniemi, Jessica (Jess)","Osseo-Maple Grove"]
["Grace Zimmer","Stillwater",3.2000000000000001E-2,4,5,5,"Stillwater","Grace Zimmer",5,"Grace Sneden","Stillwater",null,null,5,"Grace Zimmer","Stillwater"]
["Grace Gualtieri","Stillwater",3.3000000000000002E-2,6,6,6,"Stillwater","Grace Gualtieri",6,"Grace Gualtieri","Stillwater",null,null,6,"Grace Gualtieri","Stillwater"]
["Jane Sorenson","Stillwater",{"$f":"RAND()","v":4.7200632148386767E-2},7,7,7,"Stillwater","Jane Sorenson",7,"Jane Sorenson","Stillwater",null,null,7,"Jane Sorenson","Stillwater"]
["Rubie Ballantyne","Stillwater",0.3227187477453628,19,8,8,"Stillwater","Rubie Ballantyne",8,"","",null,null,8,"Rubie Ballantyne","Stillwater"]
["Hannah Dettmann","Stillwater",0.33525820650283078,20,9,9,"Stillwater","Hannah Dettmann",9,"Honnold, Emily","Osseo-Maple Grove",null,null,9,"Hannah Dettmann","Stillwater"]
{"$rows_left_out":142}
{"sheet":"Schools","index":7,"n_rows":15,"n_cols":1,"rows_kept":15,"cut":false,"hidden":true,"merged":[]}
["List of Schools:"]
["Blake"]
["Bloomington"]
["Columbia Heights"]
["Eden Prairie"]
["Edina"]
["Forest Lake"]
["Hopkins"]
["Itasca"]
["Osseo-Maple Grove"]
{"$rows_left_out":6}
{"sheet":"Official Draw","index":8,"n_rows":151,"n_cols":4,"rows_kept":151,"cut":false,"hidden":false,"merged":[]}
[]
[null,{"$f":"Draw!I1","v":"Draw #"},{"$f":"Draw!J1","v":"Name"},{"$f":"Draw!K1","v":"School"}]
[null,1,"Grace Henke","Stillwater"]
[null,2,"Drazenovich, Holly","Osseo-Maple Grove"]
[null,3,"Carolyn Wrightsman","Stillwater"]
[null,4,"Ruohoniemi, Jessica (Jess)","Osseo-Maple Grove"]
[null,5,"Grace Zimmer","Stillwater"]
[null,6,"Grace Gualtieri","Stillwater"]
[null,7,"Jane Sorenson","Stillwater"]
[null,8,"Rubie Ballantyne","Stillwater"]
{"$rows_left_out":142}
{"sheet":"Meet Results","index":9,"n_rows":150,"n_cols":23,"rows_kept":150,"cut":false,"hidden":false,"merged":[]}
[]
[null,null,null,"Osseo-Maple Grove",{"$f":"SUMIF($F5:$G24,D2,$H5:$H24)","v":4},"Stillwater",{"$f":"SUMIF($F5:$G24,F2,$H5:$H24)","v":25},null,null,null,"Edina",{"$f":"SUMIF($M5:$N24,K2,$O5:$O24)","v":0},"Edina",{"$f":"SUMIF($M5:$N24,M2,$O5:$O24)","v":0},null,null,null,"Hopkins",{"$f":"SUMIF($T5:$U24,R2,$V5:$V24)","v":0},"Hopkins",{"$f":"SUMIF($T5:$U24,T2,$V5:$V24)","v":0}]
[null,null,null," Total Score",null,null,null,null,null,null," Total Score",null,null,null,null,null,null," Total Score"]
[null,null,null,"#","Swimmer","School","Total","SCORE","PLACE",null,"#","Swimmer","School","Total","SCORE","PLACE",null,"#","Swimmer","School","Total","SCORE","PLACE"]
[null,null,null,20,"Sophie Ogaard","Stillwater",64.09210526315789,{"$f":"IF(ISNA(VLOOKUP(I5,Totals!$AX$3:$AY$102,2,FALSE)),\"\",VLOOKUP(I5,Totals!$AX$3:$AY$102,2,FALSE))","v":8},{"$f":"IF(ISNA(RANK(G5,G$5:G$150)),\"\",RANK(G5,G$5:G$150))","v":1},null,20,"Sophie Ogaard","Stillwater",64.09210526315789,{"$f":"IF(ISNA(VLOOKUP(P5,Totals!$AX$3:$AY$102,2,FALSE)),\"\",VLOOKUP(P5,Totals!$AX$3:$AY$102,2,FALSE))","v":8},{"$f":"IF(ISNA(RANK(N5,N$5:N$150)),\"\",RANK(N5,N$5:N$150))","v":1},null,20,"Sophie Ogaard","Stillwater",64.09210526315789,{"$f":"IF(ISNA(VLOOKUP(W5,Totals!$AX$3:$AY$102,2,FALSE)),\"\",VLOOKUP(W5,Totals!$AX$3:$AY$102,2,FALSE))","v":8},{"$f":"IF(ISNA(RANK(U5,U$5:U$150)),\"\",RANK(U5,U$5:U$150))","v":1}]
[null,null,null,55,"Anna Koenning","Stillwater",63.864035087719301,{"$f":"IF(ISNA(VLOOKUP(I6,Totals!$AX$3:$AY$102,2,FALSE)),\"\",VLOOKUP(I6,Totals!$AX$3:$AY$102,2,FALSE))","v":6},{"$f":"IF(G6=G5,I5,IF(ISNA(RANK(G6,G$5:G$150)),\"\",RANK(G6,G$5:G$150)))","v":2},null,55,"Anna Koenning","Stillwater",63.864035087719301,{"$f":"IF(ISNA(VLOOKUP(P6,Totals!$AX$3:$AY$102,2,FALSE)),\"\",VLOOKUP(P6,Totals!$AX$3:$AY$102,2,FALSE))","v":6},{"$f":"IF(ISNA(RANK(N6,N$5:N$150)),\"\",RANK(N6,N$5:N$150))","v":2},null,55,"Anna Koenning","Stillwater",63.864035087719301,{"$f":"IF(ISNA(VLOOKUP(W6,Totals!$AX$3:$AY$102,2,FALSE)),\"\",VLOOKUP(W6,Totals!$AX$3:$AY$102,2,FALSE))","v":6},{"$f":"IF(ISNA(RANK(U6,U$5:U$150)),\"\",RANK(U6,U$5:U$150))","v":2}]
[null,null,null,5,"Grace Zimmer","Stillwater",63.074561403508774,{"$f":"IF(ISNA(VLOOKUP(I7,Totals!$AX$3:$AY$102,2,FALSE)),\"\",VLOOKUP(I7,Totals!$AX$3:$AY$102,2,FALSE))","v":5},{"$f":"IF(G7=G6,I6,IF(ISNA(RANK(G7,G$5:G$150)),\"\",RANK(G7,G$5:G$150)))","v":3},null,5,"Grace Zimmer","Stillwater",63.074561403508774,{"$f":"IF(ISNA(VLOOKUP(P7,Totals!$AX$3:$AY$102,2,FALSE)),\"\",VLOOKUP(P7,Totals!$AX$3:$AY$102,2,FALSE))","v":5},3,null,5,"Grace Zimmer","Stillwater",63.074561403508774,{"$f":"IF(ISNA(VLOOKUP(W7,Totals!$AX$3:$AY$102,2,FALSE)),\"\",VLOOKUP(W7,Totals!$AX$3:$AY$102,2,FALSE))","v":5},3]
[null,null,null,56,"Mamie Thrall","Stillwater",63.01315789473685,{"$f":"IF(ISNA(VLOOKUP(I8,Totals!$AX$3:$AY$102,2,FALSE)),\"\",VLOOKUP(I8,Totals!$AX$3:$AY$102,2,FALSE))","v":4},4,null,56,"Mamie Thrall","Stillwater",63.01315789473685,{"$f":"IF(ISNA(VLOOKUP(P8,Totals!$AX$3:$AY$102,2,FALSE)),\"\",VLOOKUP(P8,Totals!$AX$3:$AY$102,2,FALSE))","v":4},4,null,56,"Mamie Thrall","Stillwater",63.01315789473685,{"$f":"IF(ISNA(VLOOKUP(W8,Totals!$AX$3:$AY$102,2,FALSE)),\"\",VLOOKUP(W8,Totals!$AX$3:$AY$102,2,FALSE))","v":4},4]
[null,null,null,29,"McBride, Elizabeth (Lizzy)","Osseo-Maple Grove",62.236842105263165,{"$f":"IF(ISNA(VLOOKUP(I9,Totals!$AX$3:$AY$102,2,FALSE)),\"\",VLOOKUP(I9,Totals!$AX$3:$AY$102,2,FALSE))","v":3},5,null,29,"McBride, Elizabeth (Lizzy)","Osseo-Maple Grove",62.236842105263165,{"$f":"IF(ISNA(VLOOKUP(P9,Totals!$AX$3:$AY$102,2,FALSE)),\"\",VLOOKUP(P9,Totals!$AX$3:$AY$102,2,FALSE))","v":3},5,null,29,"McBride, Elizabeth (Lizzy)","Osseo-Maple Grove",62.236842105263165,{"$f":"IF(ISNA(VLOOKUP(W9,Totals!$AX$3:$AY$102,2,FALSE)),\"\",VLOOKUP(W9,Totals!$AX$3:$AY$102,2,FALSE))","v":3},5]
[null,null,null,6,"Grace Gualtieri","Stillwater",62.14473684210526,{"$f":"IF(ISNA(VLOOKUP(I10,Totals!$AX$3:$AY$102,2,FALSE)),\"\",VLOOKUP(I10,Totals!$AX$3:$AY$102,2,FALSE))","v":2},6,null,6,"Grace Gualtieri","Stillwater",62.14473684210526,{"$f":"IF(ISNA(VLOOKUP(P10,Totals!$AX$3:$AY$102,2,FALSE)),\"\",VLOOKUP(P10,Totals!$AX$3:$AY$102,2,FALSE))","v":2},6,null,6,"Grace Gualtieri","Stillwater",62.14473684210526,{"$f":"IF(ISNA(VLOOKUP(W10,Totals!$AX$3:$AY$102,2,FALSE)),\"\",VLOOKUP(W10,Totals!$AX$3:$AY$102,2,FALSE))","v":2},6]
{"$rows_left_out":140}